Ontoterminology of Vases
type: ConceptScheme
description: Archaic and Classical Periods, from -700 BC to -323. The concepts of the ontology are linked with a skos:exactMatch to Getty Vocabularies, Wikidata and Kerameikos. The ontology of kraters is populated with all the kraters of the collection of the National Archeological Museum (NAM) in Athens representing medata from the Beazley Archive Pottery Database. Each object is linked with a skos:ExactMatch to its web description in Beazley.
issued: 2019-4-28
modified: 2024-3-5
creator: Maria Papadopoulou
publisher: Condillac
type: Ontology

Vessel for mixing wine with water with handles with foot with open mouth without neck
type: Concept
in scheme: Ontoterminology of Vases
broader: krater
narrower: bell krater
narrower: calyx krater
type: Class
subclass of: krater
disjoint with: Vessel for mixing wine with water with handles with foot with open mouth with neck with a clearly defined neck
subclass of: Restriction
  on property: ownDifference
  has value: without neck
conceptName: <Vessel for mixing wine with water with handles with foot with open mouth without neck>
isA: krater
ownDifference: without neck
inheritedDifference: with open mouth
inheritedDifference: with foot
inheritedDifference: with handles
inheritedDifference: for mixing wine with water
inheritedDifference: vessel
difference: without neck
difference: with open mouth
difference: with foot
difference: with handles
difference: for mixing wine with water
difference: vessel
found at: lieu
attribute: date
attribute: diameter
attribute: height
attribute: type of material
attribute: provenance
attribute: vase number in Beazley
attribute: fabric
attribute: technique
attribute: attributed to
attribute: decoration
attribute: current collection
attribute: previous collection
attribute: publication record
attribute: LIMC ID
attribute: pleiades coordinates

Vessel for mixing wine with water with handles with foot with open mouth with neck with a clearly defined neck
type: Concept
in scheme: Ontoterminology of Vases
broader: krater
narrower: column krater
narrower: volute krater
type: Class
subclass of: krater
disjoint with: Vessel for mixing wine with water with handles with foot with open mouth without neck
subclass of: Restriction
  on property: ownDifference
  has value: with neck
subclass of: Restriction
  on property: ownDifference
  has value: with a clearly defined neck
conceptName: <Vessel for mixing wine with water with handles with foot with open mouth with neck with a clearly defined neck>
isA: krater
ownDifference: with neck
ownDifference: with a clearly defined neck
inheritedDifference: with open mouth
inheritedDifference: with foot
inheritedDifference: with handles
inheritedDifference: for mixing wine with water
inheritedDifference: vessel
difference: with a clearly defined neck
difference: with neck
difference: with open mouth
difference: with foot
difference: with handles
difference: for mixing wine with water
difference: vessel
found at: lieu
attribute: date
attribute: diameter
attribute: height
attribute: type of material
attribute: provenance
attribute: vase number in Beazley
attribute: fabric
attribute: technique
attribute: attributed to
attribute: decoration
attribute: current collection
attribute: previous collection
attribute: publication record
attribute: LIMC ID
attribute: pleiades coordinates

bell krater
type: Concept
in scheme: Ontoterminology of Vases
definition: Krater without neck, with upward curling handles placed high on the body.
note: "The latest of the four krater-types, it first occurs in the early fifth century, and is not found decorated in black-figure. It is named for its bell-like shape, perhaps originating in wood. It has small horizontal upturned handles just over halfway up the body. Some do not have a foot, and earlier examples may have lugs for handles. Over the course of the fifth and fourth centuries, the shape becomes slimmer." Classical Art Research Centre, University of Oxford. Accessible online: https:www.beazley.ox.ac.uktoolspotteryshapesbell.htm (2020 05 08)
example: The bell krater is a vessel new to the red-figure style, and is established in the repertory of the potters by about 500 B.C. It continues through the early fourth century B.C. http:www.perseus.tufts.eduhoppertext?doc=Perseus%3Atext%3A1999.04.0004%3Aalphabetic+letter%3DB%3Aentry+group%3D2%3Aentry%3Dbell-krater
label: cratère en cloche @fr
label: κρατήρας κωδωνόσχημος @el
definition: Κρατήρας χωρίς λαιμό, με λαβές καμπυλωτές προς τα πάνω που βρίσκονται ψηλά στο σώμα του αγγείου. @el
broader: Vessel for mixing wine with water with handles with foot with open mouth without neck
type: Class
subclass of: Vessel for mixing wine with water with handles with foot with open mouth without neck
disjoint with: calyx krater
subclass of: Restriction
  on property: ownDifference
  has value: with upward curling handles
subclass of: Restriction
  on property: ownDifference
  has value: upward curling handles placed high on the body
conceptName: <Vessel for mixing wine with water with handles with foot with open mouth without neck with upward curling handles upward curling handles placed high on the body>
isA: Vessel for mixing wine with water with handles with foot with open mouth without neck
ownDifference: with upward curling handles
ownDifference: upward curling handles placed high on the body
inheritedDifference: without neck
inheritedDifference: with open mouth
inheritedDifference: with foot
inheritedDifference: with handles
inheritedDifference: for mixing wine with water
inheritedDifference: vessel
difference: upward curling handles placed high on the body
difference: with upward curling handles
difference: without neck
difference: with open mouth
difference: with foot
difference: with handles
difference: for mixing wine with water
difference: vessel
found at: lieu
attribute: date
attribute: diameter
attribute: height
attribute: type of material
attribute: provenance
attribute: vase number in Beazley
attribute: fabric
attribute: technique
attribute: attributed to
attribute: decoration
attribute: current collection
attribute: previous collection
attribute: publication record
attribute: LIMC ID
attribute: pleiades coordinates
denotedByTerm: bell krater
denotedByTerm: cratère en cloche
denotedByTerm: κρατήρας κωδωνόσχημος

Clay
type: Concept
in scheme: Ontoterminology of Vases
broader: Material
type: Class
subclass of: Material
conceptName: <Clay>
isA: Material
inheritedDifference: material
difference: material

calyx krater
type: Concept
in scheme: Ontoterminology of Vases
definition: Krater without neck, with upward curling handles placed low on the body.
note: "The handles of the calyx-krater are placed low down on the body, at what is termed the cul. Their upward curling form lends the shape an appearance reminiscent of the calyx of a flower, hence the name. The earliest known example was possibly made by Exekias in the third quarter of the sixth century. It continues to be produced, mainly in red-figure, becoming more elongated over the course of the fifth and fourth centuries." Classical Art Research Centre, University of Oxford. Accessible online: https:www.beazley.ox.ac.uktoolspotteryshapescalyx.htm 2020 05 08
note: "The calyx-krater is one of the largest Attic vases, and is reminiscent of a bell-shaped flower. It is named for its convex lower body that has the configuration of the calyx of a flower, while the flaring upper body is suggestive of the bell-shaped corolla. It has large, robust, upturned handles situated opposite one another on the cul.The calyx-krater appears in Attic black-figure after the middle of the 6th c. BCE and is a popular shape until the end of red-figure." http:kerameikos.orgidcalyx_krater
label: cratère en calice @fr
label: κρατήρας καλυκοειδής @el
definition: Κρατήρας χωρίς λαιμό, με λαβές καμπυλωτές προς τα πάνω που βρίσκονται χαμηλά στο σώμα του αγγείου. @el
broader: Vessel for mixing wine with water with handles with foot with open mouth without neck
type: Class
subclass of: Vessel for mixing wine with water with handles with foot with open mouth without neck
disjoint with: bell krater
subclass of: Restriction
  on property: ownDifference
  has value: with upward curling handles
subclass of: Restriction
  on property: ownDifference
  has value: upward curling handles placed low on the body
conceptName: <Vessel for mixing wine with water with handles with foot with open mouth without neck with upward curling handles upward curling handles placed low on the body>
isA: Vessel for mixing wine with water with handles with foot with open mouth without neck
ownDifference: with upward curling handles
ownDifference: upward curling handles placed low on the body
inheritedDifference: without neck
inheritedDifference: with open mouth
inheritedDifference: with foot
inheritedDifference: with handles
inheritedDifference: for mixing wine with water
inheritedDifference: vessel
difference: upward curling handles placed low on the body
difference: with upward curling handles
difference: without neck
difference: with open mouth
difference: with foot
difference: with handles
difference: for mixing wine with water
difference: vessel
found at: lieu
attribute: date
attribute: diameter
attribute: height
attribute: type of material
attribute: provenance
attribute: vase number in Beazley
attribute: fabric
attribute: technique
attribute: attributed to
attribute: decoration
attribute: current collection
attribute: previous collection
attribute: publication record
attribute: LIMC ID
attribute: pleiades coordinates
denotedByTerm: calyx krater
denotedByTerm: cratère en calice
denotedByTerm: κρατήρας καλυκοειδής

pelike
type: Concept
in scheme: Ontoterminology of Vases
definition: Amphora with foot and a sagging belly.
note: "A variation of the one-piece amphora, so called because the neck flows smoothly into the body, in contrast to the offset neck of a neck amphora. History: The shape first appears in Attic red-figure after 520 B.C. and remains popular through the fourth century B.C. The shape is taken over by the potters of Gnathia, where it becomes slimmer and more fanciful. The widest portion of the pelike is towards its base. Term: The Greek word "pelike" was not applied to this shape in ancient times but was adopted by modern archaeologists; the ancient "pelike" is described variously as a kylix, a chous (or small oinochoe), and a lekanis." http:www.perseus.tufts.eduhoppertext?doc=Perseus:text:1999.04.0004:id=pelike
label: πελίκη @el
definition: Αμφορέας με πόδι, ευδιάκριτο λαιμό και κοιλιά που γέρνει προς τα κάτω. @el
broader: Vessel for storing and transport with neck with handles with two handles liquid or solid with foot
type: Class
subclass of: Vessel for storing and transport with neck with handles with two handles liquid or solid with foot
disjoint with: belly amphora
disjoint with: neck amphora
subclass of: Restriction
  on property: ownDifference
  has value: without a clearly defined neck
subclass of: Restriction
  on property: ownDifference
  has value: with sagging belly
conceptName: <Vessel for storing and transport with neck with handles with two handles liquid or solid with foot without a clearly defined neck with sagging belly>
isA: Vessel for storing and transport with neck with handles with two handles liquid or solid with foot
ownDifference: without a clearly defined neck
ownDifference: with sagging belly
inheritedDifference: with foot
inheritedDifference: liquid or solid
inheritedDifference: with two handles
inheritedDifference: with handles
inheritedDifference: with neck
inheritedDifference: for storing and transport
inheritedDifference: vessel
difference: with sagging belly
difference: without a clearly defined neck
difference: with foot
difference: liquid or solid
difference: with two handles
difference: with handles
difference: with neck
difference: for storing and transport
difference: vessel
found at: lieu
attribute: date
attribute: diameter
attribute: height
attribute: type of material
attribute: provenance
attribute: vase number in Beazley
attribute: fabric
attribute: technique
attribute: attributed to
attribute: decoration
attribute: current collection
attribute: previous collection
attribute: publication record
attribute: LIMC ID
attribute: pleiades coordinates
denotedByTerm: pelike
denotedByTerm: πελίκη

belly amphora
type: Concept
in scheme: Ontoterminology of Vases
definition: Amphora with foot, without a clearly defined neck.
note: "The belly-amphora has a continuous profile from lip to foot. It is usually lidded." https:www.beazley.ox.ac.uktoolspotteryshapesbelly.htm
label: αμφορέας με κοιλιά @el
definition: Αμφορέας με πόδι, ευδιάκριτο λαιμό και κανονική κοιλιά. @el
broader: Vessel for storing and transport with neck with handles with two handles liquid or solid with foot
narrower: type A amphora
narrower: type B amphora
narrower: type C amphora
type: Class
subclass of: Vessel for storing and transport with neck with handles with two handles liquid or solid with foot
disjoint with: pelike
disjoint with: neck amphora
subclass of: Restriction
  on property: ownDifference
  has value: without a clearly defined neck
subclass of: Restriction
  on property: ownDifference
  has value: with standard belly
conceptName: <Vessel for storing and transport with neck with handles with two handles liquid or solid with foot without a clearly defined neck with standard belly>
isA: Vessel for storing and transport with neck with handles with two handles liquid or solid with foot
ownDifference: without a clearly defined neck
ownDifference: with standard belly
inheritedDifference: with foot
inheritedDifference: liquid or solid
inheritedDifference: with two handles
inheritedDifference: with handles
inheritedDifference: with neck
inheritedDifference: for storing and transport
inheritedDifference: vessel
difference: with standard belly
difference: without a clearly defined neck
difference: with foot
difference: liquid or solid
difference: with two handles
difference: with handles
difference: with neck
difference: for storing and transport
difference: vessel
found at: lieu
attribute: date
attribute: diameter
attribute: height
attribute: type of material
attribute: provenance
attribute: vase number in Beazley
attribute: fabric
attribute: technique
attribute: attributed to
attribute: decoration
attribute: current collection
attribute: previous collection
attribute: publication record
attribute: LIMC ID
attribute: pleiades coordinates
denotedByTerm: belly amphora
denotedByTerm: αμφορέας με κοιλιά

amphora
type: Concept
in scheme: Ontoterminology of Vases
definition: Vase with neck and two handles for storing and transport liquids and solids.
note: "The amphora (pl. amphorae; from Greek amphi - on both sides, phero - carry) is a two-handled pot with a neck that is considerably narrower than the body. It was used for the storage of liquids and solids such as grain. Undecorated 'coarse' amphorae, with their lower part tapering to a point, were the standard transport containers in the Mediterranean. They are frequently depicted in symposium scenes. Panathenaic prize amphorae are perhaps the closest in shape, but the majority of painted amphorae are grouped into two main types, the one-piece belly-amphorae, and neck-amphorae, which have a clearly-marked neck. Also discussed here is the pelike, another two-handled storage vessel." http:www.beazley.ox.ac.uktoolspotteryshapesamphorae.htm 2020-05-03
note: ἀμφορ-εύς , έως, ὁ: acc. A.“ἀμφορέα” Ar.Fr.299: dual “ἀμφορῆ” Telecl.2 D.: pl. “ἀμφορῆς” Ar.Nu.1203:—jar with narrow neck (“στενόστομον τὸ τεῦχος” Id.Fr. 108), Hdt.4.163, Ar.Nu.1203, etc.; used for various purposes, esp. for keeping wine in, Pl.807, Fr.299; or milk, E.Cyc.327; for pickles, X. An.5.4.28. 2. ornament in shape of vase, “ὅρμος -έων” IG11(2).161B 38 (Delos, iii B.C.), cf. SIG2588.199 (ib., ii B.C.). II. liquid measure, = μετρητής (Philyll.7, Moer.45, etc.), 1 12 Roman amphorae or nearly 9 gallons, Hdt.1.51, IG3.38, D.43.8, etc. (Shortened form of ἀμφιφορεύς, q.v., from having two handles.） http:www.perseus.tufts.eduhoppertext?doc=Perseus:text:1999.04.0057:entry=a)mforeus 2020 05 08
note: "A two-handled vase with a narrow neck used for storage or transport. This vessel shape is common in both plain and decorated wares. Transport amphorae are large undecorated vessels, often with pointed bases. Attic decorated wares favor the amphora shape and many subdivisions of the type have been identified. Term: The word is Greek, and is apparently the ancient name for this vessel." http:www.perseus.tufts.eduhoppertext?doc=Perseus:text:1999.04.0004:id=amphora
example: ὁ δὲ Ἀρκεσίλεως τοῦτον τὸν χρόνον ἐὼν ἐν Σάμῳ συνήγειρε πάντα ἄνδρα ἐπὶ γῆς ἀναδασμῷ: συλλεγομένου δὲ στρατοῦ πολλοῦ, ἐστάλη ἐς Δελφοὺς Ἀρκεσίλεως χρησόμενος τῷ χρηστηρίῳ περὶ κατόδου. [2] ἡ δὲ Πυθίη οἱ χρᾷ τάδε. “‘ἐπὶ μὲν τέσσερας Βᾶττους καὶ Ἀρκεσίλεως τέσσερας, ὀκτὼ ἀνδρῶν γενεάς, διδοῖ ὑμῖν Λοξίης βασιλεύειν Κυρήνης, [3] πλέον μέντοι τούτου οὐδὲ πειρᾶσθαι παραινέει. σὺ μέντοι ἥσυχος εἶναι κατελθὼν ἐς τὴν σεωυτοῦ. ἢν δὲ τὴν κάμινον εὕρῃς πλέην ἀμφορέων, μὴ ἐξοπτήσῃς τοὺς ἀμφορέας ἀλλ᾽ ἀπόπεμπε κατ᾽ οὖρον: εἰ δὲ ἐξοπτήσεις τὴν κάμινον,1μὴ ἐσέλθῃς ἐς τὴν ἀμφίρρυτον: εἰ δὲ μὴ ἀποθανέαι καὶ αὐτὸς καὶ ταῦρος ὁ καλλιστεύων.’” ταῦτα ἡ Πυθίη Ἀρκεσίλεῳ χρᾷ. Hdt. 4.163 http:www.perseus.tufts.eduhoppertext?doc=Perseus:abo:tlg,0016,001:4:163&lang=original 2020 05 08
example: ""The amphorae are full of red and fragrant wine." Aristoph. Pl. 807 http:www.perseus.tufts.eduhoppertext?doc=Aristoph.%20Pl.%20807&lang=original
example: "drinking a whole amphora of milk." Eur. Cycl. 327 http:www.perseus.tufts.eduhoppertext?doc=Eur.%20Cycl.%20327&lang=original
example: "They found pickled slices of dolphin in amphorae." Xen. Anab. 5.4.28 http:www.perseus.tufts.eduhoppertext?doc=Xen.%20Anab.%205.4.28&lang=original
label: amphore @fr
label: αμφορέας @el
definition: Αγγείο για αποθήκευση και μεταφορά, με λαιμό, με δύο λαβές, για υγρά ή στερεά. @el
note: modern greek @el
label: ἀμφορεύς @el
note: The term first appears in Linear B tablets dating in the 2nd millenium B.C. @el
broader: vase
narrower: Vessel for storing and transport with neck with handles with two handles liquid or solid with foot
narrower: Vessel for storing and transport with neck with handles with two handles liquid or solid without foot
type: Class
subclass of: vase
disjoint with: hydria
disjoint with: lekythos
disjoint with: krater
disjoint with: panathenaic prize amphora
subclass of: Restriction
  on property: ownDifference
  has value: for storing and transport
subclass of: Restriction
  on property: ownDifference
  has value: with neck
subclass of: Restriction
  on property: ownDifference
  has value: with handles
subclass of: Restriction
  on property: ownDifference
  has value: with two handles
subclass of: Restriction
  on property: ownDifference
  has value: liquid or solid
conceptName: <Vessel for storing and transport with neck with handles with two handles liquid or solid>
isA: vase
ownDifference: for storing and transport
ownDifference: with neck
ownDifference: with handles
ownDifference: with two handles
ownDifference: liquid or solid
inheritedDifference: vessel
difference: liquid or solid
difference: with two handles
difference: with handles
difference: with neck
difference: for storing and transport
difference: vessel
found at: lieu
attribute: date
attribute: diameter
attribute: height
attribute: type of material
attribute: provenance
attribute: vase number in Beazley
attribute: fabric
attribute: technique
attribute: attributed to
attribute: decoration
attribute: current collection
attribute: previous collection
attribute: publication record
attribute: LIMC ID
attribute: pleiades coordinates
denotedByTerm: amphora
denotedByTerm: amphore
denotedByTerm: αμφορέας
denotedByTerm: ἀμφορεύς

personne
type: Concept
in scheme: Ontoterminology of Vases
top concept of: Ontoterminology of Vases
broad match: E21 Person
type: Class
disjoint with: Material
disjoint with: lieu
disjoint with: vase
subclass of: Restriction
  on property: ownDifference
  has value: person
conceptName: <Person>
ownDifference: person
difference: person
denotedByTerm: personne

Vessel for storing and transport with neck with handles with two handles liquid or solid with foot
type: Concept
in scheme: Ontoterminology of Vases
broader: amphora
narrower: pelike
narrower: belly amphora
narrower: neck amphora
type: Class
subclass of: amphora
disjoint with: Vessel for storing and transport with neck with handles with two handles liquid or solid without foot
subclass of: Restriction
  on property: ownDifference
  has value: with foot
conceptName: <Vessel for storing and transport with neck with handles with two handles liquid or solid with foot>
isA: amphora
ownDifference: with foot
inheritedDifference: liquid or solid
inheritedDifference: with two handles
inheritedDifference: with handles
inheritedDifference: with neck
inheritedDifference: for storing and transport
inheritedDifference: vessel
difference: with foot
difference: liquid or solid
difference: with two handles
difference: with handles
difference: with neck
difference: for storing and transport
difference: vessel
found at: lieu
attribute: date
attribute: diameter
attribute: height
attribute: type of material
attribute: provenance
attribute: vase number in Beazley
attribute: fabric
attribute: technique
attribute: attributed to
attribute: decoration
attribute: current collection
attribute: previous collection
attribute: publication record
attribute: LIMC ID
attribute: pleiades coordinates

hydria
type: Concept
in scheme: Ontoterminology of Vases
definition: Vase with neck and three handles, two for carrying and one for pouring, for storing and transport water.
note: An old shape, with precursors in the eighth century, the hydria (pl. hydriai; compare Greek hudor - water) is a water-jar with three handles, two for carrying and one for pouring. The application of the name to the shape is reasonably certain, although such vessels were not only used for the carrying of water. We know, for example, that hydriai held votes in ballots and ashes in cemeteries. http:www.beazley.ox.ac.uktoolspotteryshapeshydria.htm 2020 05 08
note: ὑδρ-ία , ἡ, (ὕδωρ) A.water-pot, pitcher, Ar.V.926, Ec.678 (anap.), LXX Ec.12.6, CIG2855.10 (Branchidae), Ev.Jo.2.6, etc.; ὑδρίης πέρι δῆρις (cf. ἀμφορίτης) A.R.4.1767: prov., ἐπὶ θύραις τὴν ὑδρίαν to break the pitcher at the door, 'there's many a slip 'twixt cup and lip', Arist.Rh.1363a7. II. vessel of any kind, e. g. wine-pot, Ar.Fr. 136; a pot of money, Id.Av.602 (anap.) (ἐν ὑδρίαις γὰρ ἔκειντο οἱ θησαυροί Sch. ad loc.(603)), cf. IG11(2).161 B100 (Delos, iii B. C.); “ὑ. χαλκῆ” D.47.52; ὑ. χρυσῆ, ἀργυρᾶ, IG22.204.35; ὑδρίαι ἄρτων πέντε bread-pans, POxy.155.4 (vi A. D.). 2. balloting urn, esp. in lawcourts, etc., IG9(1).334.45 (Locr., v B. C.), Isoc.17.33, Plu.TG11. 3. cinerary urn, Id.Phil.21, Luc.Dem.Enc.29, etc. 4. water-clock, S.E.M.5.75, Jul.Caes.325c. [ι_ in A.R. l.c., where ὑδρείης is v.l.] http:www.perseus.tufts.eduhoppertext?doc=Perseus%3Atext%3A1999.04.0057%3Aentry%3Du(dri%2Fa (2020 05 08)
example: [6] ἦσαν δὲ ἐκεῖ λίθιναι ὑδρίαι ἓξ κατὰ τὸν καθαρισμὸν τῶν Ἰουδαίων κείμεναι, χωροῦσαι ἀνὰ μετρητὰς δύο ἢ τρεῖς. John 2.6 http:www.perseus.tufts.eduhoppertext?doc=Perseus%3Atext%3A1999.01.0155%3Abook%3DJohn%3Achapter%3D2%3Averse%3D6 (2020 05 08)
example: Πραξάγορα τοὺς κρατῆρας καταθήσω καὶ τὰς ὑδρίας, καὶ ῥαψῳδεῖν ἔσται τοῖς παιδαρίοισιν τοὺς ἀνδρείους ἐν τῷ πολέμῳ, κεἴ τις δειλὸς γεγένηται, 680ἵνα μὴ δειπνῶσ᾽ αἰσχυνόμενοι. Aristoph. Eccl. 678 http:www.perseus.tufts.eduhoppertext?doc=Perseus:abo:tlg,0019,010:678&lang=original 2020 05 08
label: hydrie @fr
label: υδρία @el
definition: Αγγείο για αποθήκευση και μεταφορά νερού, με τρεις λαβές και λαιμό. @el
note: modern greek @el
label: ὑδρία @el
definition: Αγγείο για αποθήκευση και μεταφορά νερού με τρεις λαβές και λαιμό @el
note: http:www.perseus.tufts.eduhoppermorph?l=u%28dri%2Fa&la=greek#lexicon @el
broader: vase
type: Class
subclass of: vase
disjoint with: lekythos
disjoint with: amphora
disjoint with: panathenaic prize amphora
disjoint with: krater
subclass of: Restriction
  on property: ownDifference
  has value: for storing and transport
subclass of: Restriction
  on property: ownDifference
  has value: liquid only
subclass of: Restriction
  on property: ownDifference
  has value: water
subclass of: Restriction
  on property: ownDifference
  has value: with neck
subclass of: Restriction
  on property: ownDifference
  has value: with handles
subclass of: Restriction
  on property: ownDifference
  has value: with three handles
conceptName: <Vessel for storing and transport liquid only water with neck with handles with three handles>
isA: vase
ownDifference: for storing and transport
ownDifference: liquid only
ownDifference: water
ownDifference: with neck
ownDifference: with handles
ownDifference: with three handles
inheritedDifference: vessel
difference: with three handles
difference: with handles
difference: with neck
difference: water
difference: liquid only
difference: for storing and transport
difference: vessel
found at: lieu
attribute: date
attribute: diameter
attribute: height
attribute: type of material
attribute: provenance
attribute: vase number in Beazley
attribute: fabric
attribute: technique
attribute: attributed to
attribute: decoration
attribute: current collection
attribute: previous collection
attribute: publication record
attribute: LIMC ID
attribute: pleiades coordinates
denotedByTerm: hydria
denotedByTerm: hydrie
denotedByTerm: υδρία
denotedByTerm: ὑδρία

neck amphora
type: Concept
in scheme: Ontoterminology of Vases
definition: Amphora with foot, with a clearly defined neck.
note: "The neck-amphora is identifiable by its clearly defined neck." https:www.beazley.ox.ac.uktoolspotteryshapesneck.htm
label: αμφορέας με λαιμό @el
definition: Αμφορέας με πόδι, ευδιάκριτο λαιμό και κανονική κοιλιά. @el
broader: Vessel for storing and transport with neck with handles with two handles liquid or solid with foot
type: Class
subclass of: Vessel for storing and transport with neck with handles with two handles liquid or solid with foot
disjoint with: pelike
disjoint with: belly amphora
subclass of: Restriction
  on property: ownDifference
  has value: with a clearly defined neck
subclass of: Restriction
  on property: ownDifference
  has value: with standard belly
conceptName: <Vessel for storing and transport with neck with handles with two handles liquid or solid with foot with a clearly defined neck with standard belly>
isA: Vessel for storing and transport with neck with handles with two handles liquid or solid with foot
ownDifference: with a clearly defined neck
ownDifference: with standard belly
inheritedDifference: with foot
inheritedDifference: liquid or solid
inheritedDifference: with two handles
inheritedDifference: with handles
inheritedDifference: with neck
inheritedDifference: for storing and transport
inheritedDifference: vessel
difference: with standard belly
difference: with a clearly defined neck
difference: with foot
difference: liquid or solid
difference: with two handles
difference: with handles
difference: with neck
difference: for storing and transport
difference: vessel
found at: lieu
attribute: date
attribute: diameter
attribute: height
attribute: type of material
attribute: provenance
attribute: vase number in Beazley
attribute: fabric
attribute: technique
attribute: attributed to
attribute: decoration
attribute: current collection
attribute: previous collection
attribute: publication record
attribute: LIMC ID
attribute: pleiades coordinates
denotedByTerm: neck amphora
denotedByTerm: αμφορέας με λαιμό

volute krater
type: Concept
in scheme: Ontoterminology of Vases
definition: Krater with a clearly defined neck and volute-like handles.
note: "The volute-krater is named after its handles. The François Vase is a famous and early example, but the typical Athenian form occurs only later in the sixth century, with the handles tightly curled so that they look like the volutes on Ionic columns. The shape is also found in metal. Over the course of the fifth and fourth centuries, examples become slimmer, and Apulian volute-kraters from South Italy are particularly elaborate." Classical Art Research Centre, University of Oxford. Accessible online: https:www.beazley.ox.ac.uktoolspotteryshapesvolute.htm 2020 05 08
label: cratère à volutes @fr
definition: Cratère avec cou, avec des anses en forme de volutes. @fr
label: κρατήρας ελικοειδής @el
definition: Κρατήρας με λαιμό και ελικοειδείς λαβές. @el
broader: Vessel for mixing wine with water with handles with foot with open mouth with neck with a clearly defined neck
type: Class
subclass of: Vessel for mixing wine with water with handles with foot with open mouth with neck with a clearly defined neck
disjoint with: column krater
subclass of: Restriction
  on property: ownDifference
  has value: with volute-like handles
conceptName: <Vessel for mixing wine with water with handles with foot with open mouth with neck with a clearly defined neck with volute-like handles>
isA: Vessel for mixing wine with water with handles with foot with open mouth with neck with a clearly defined neck
ownDifference: with volute-like handles
inheritedDifference: with a clearly defined neck
inheritedDifference: with neck
inheritedDifference: with open mouth
inheritedDifference: with foot
inheritedDifference: with handles
inheritedDifference: for mixing wine with water
inheritedDifference: vessel
difference: with volute-like handles
difference: with a clearly defined neck
difference: with neck
difference: with open mouth
difference: with foot
difference: with handles
difference: for mixing wine with water
difference: vessel
found at: lieu
attribute: date
attribute: diameter
attribute: height
attribute: type of material
attribute: provenance
attribute: vase number in Beazley
attribute: fabric
attribute: technique
attribute: attributed to
attribute: decoration
attribute: current collection
attribute: previous collection
attribute: publication record
attribute: LIMC ID
attribute: pleiades coordinates
denotedByTerm: volute krater
denotedByTerm: cratère à volutes
denotedByTerm: κρατήρας ελικοειδής

lekythos
type: Concept
in scheme: Ontoterminology of Vases
definition: Vase for perfume for oil, with narrow neck, with one handle.
note: Like the aryballos, in that it has a narrow neck and a single handle, the lekythos (pl. lekythoi) is generally a taller vessel with a small, deep mouth. The Greek word lekythos was undoubtedly used for the various forms considered here, although it does appear that it was used for oil-vessels in general. http:www.beazley.ox.ac.uktoolspotteryshapeslekythos.htm 2020 05 08
note: λήκυ^θος (Dor. λάκυθος [α_] IG42(1).123.130 (Epid., iv B.C.)), ἡ, A.oil-flask, “δῶκεν δὲ χρυσέῃ ἐν ληκύθῳ ὑγρὸν ἔλαιον” Od.6.79, cf. 215, Hp. Morb.4.51, Ph.Bel.102.41, etc.; casket for unguents, cosmetics, etc., S.Fr.130; “αἱ δὲ λήκυθοι μύρου γέμουσι” Ar.Pl.810, cf. Fr.207; buried or burnt with the dead, Id.Ec.538, 996, 1032, cf. IG14.865, CIG 8346k. 2. in pl., rhetorical bombast, Cic.Att.1.14.3, Plin.Ep.1.2.4. II. projecting cartilage on the gullet, Adam's apple, = βρόχθος, Clearch.72. http:www.perseus.tufts.eduhoppertext?doc=Perseus%3Atext%3A1999.04.0057%3Aentry%3Dlh%2Fkuqos 2020 05 08
example: λήκυ^θος (Dor. λάκυθος [α_] IG42(1).123.130 (Epid., iv B.C.)), ἡ, A.oil-flask, “δῶκεν δὲ χρυσέῃ ἐν ληκύθῳ ὑγρὸν ἔλαιον” Od.6.79, cf. 215, Hp. Morb.4.51, Ph.Bel.102.41, etc.; casket for unguents, cosmetics, etc., S.Fr.130; “αἱ δὲ λήκυθοι μύρου γέμουσι” Ar.Pl.810, cf. Fr.207; buried or burnt with the dead, Id.Ec.538, 996, 1032, cf. IG14.865, CIG 8346k. 2. in pl., rhetorical bombast, Cic.Att.1.14.3, Plin.Ep.1.2.4. II. projecting cartilage on the gullet, Adam's apple, = βρόχθος, Clearch.72.
label: lécythe @fr
note: Un lécythe (du grec ancien λήκυθος lếkuthos) est un vase grec antique utilisé pour stocker de l'huile parfumée destinée aux soins du corps. La forme est inventée dans la première moitié du VIe siècle av. J.-C.. Un type particulier, le lécythe à fond blanc, est très fréquemment utilisé comme vase funéraire. https:fr.wikipedia.orgwikiL%C3%A9cythe 30042020 @fr
label: λήκυθος @el
definition: Αγγείο για άρωμα, με στενό λαιμό, με μία λαβή. @el
broader: vase
type: Class
subclass of: vase
disjoint with: hydria
disjoint with: amphora
disjoint with: panathenaic prize amphora
disjoint with: krater
subclass of: Restriction
  on property: ownDifference
  has value: for perfume
subclass of: Restriction
  on property: ownDifference
  has value: with neck
subclass of: Restriction
  on property: ownDifference
  has value: with narrow neck
subclass of: Restriction
  on property: ownDifference
  has value: with handles
subclass of: Restriction
  on property: ownDifference
  has value: with one handle
subclass of: Restriction
  on property: ownDifference
  has value: liquid only
subclass of: Restriction
  on property: ownDifference
  has value: oil
conceptName: <Vessel for perfume with neck with narrow neck with handles with one handle liquid only>
isA: vase
ownDifference: for perfume
ownDifference: with neck
ownDifference: with narrow neck
ownDifference: with handles
ownDifference: with one handle
ownDifference: liquid only
ownDifference: oil
inheritedDifference: vessel
difference: oil
difference: liquid only
difference: with one handle
difference: with handles
difference: with narrow neck
difference: with neck
difference: for perfume
difference: vessel
found at: lieu
attribute: date
attribute: diameter
attribute: height
attribute: type of material
attribute: provenance
attribute: vase number in Beazley
attribute: fabric
attribute: technique
attribute: attributed to
attribute: decoration
attribute: current collection
attribute: previous collection
attribute: publication record
attribute: LIMC ID
attribute: pleiades coordinates
denotedByTerm: lekythos
denotedByTerm: lécythe
denotedByTerm: λήκυθος

panathenaic prize amphora
type: Concept
in scheme: Ontoterminology of Vases
definition: Vase with foot, two handles, and neck, which served as prize in the Panathenaic games. Its names comes from its shape (like an amphora) and in connection to the Panathenaic festival.
note: "The broad body, narrow neck and foot of Panathenaic amphorae gives a shape reminiscent of transport amphorae. They served as prizes in the Panathenaic Games, containing oil for victors." https:www.beazley.ox.ac.uktoolspotteryshapespanathenaic.htm
label: panathenaic amphora
label: παναθηναϊκός αμφορέας @el
definition: Αμφορέας που δίνεται ως έπαθλο σε νικητές των Παναθηναίων. @el
broader: vase
type: Class
subclass of: vase
disjoint with: lekythos
disjoint with: hydria
disjoint with: krater
disjoint with: amphora
subclass of: Restriction
  on property: ownDifference
  has value: for prize
subclass of: Restriction
  on property: ownDifference
  has value: with foot
subclass of: Restriction
  on property: ownDifference
  has value: with handles
subclass of: Restriction
  on property: ownDifference
  has value: with two handles
subclass of: Restriction
  on property: ownDifference
  has value: with neck
conceptName: <Vessel for prize with foot with handles with two handles with neck>
isA: vase
ownDifference: for prize
ownDifference: with foot
ownDifference: with handles
ownDifference: with two handles
ownDifference: with neck
inheritedDifference: vessel
difference: with neck
difference: with two handles
difference: with handles
difference: with foot
difference: for prize
difference: vessel
found at: lieu
attribute: date
attribute: diameter
attribute: height
attribute: type of material
attribute: provenance
attribute: vase number in Beazley
attribute: fabric
attribute: technique
attribute: attributed to
attribute: decoration
attribute: current collection
attribute: previous collection
attribute: publication record
attribute: LIMC ID
attribute: pleiades coordinates
denotedByTerm: panathenaic prize amphora
denotedByTerm: panathenaic amphora
denotedByTerm: παναθηναϊκός αμφορέας

type C amphora
type: Concept
in scheme: Ontoterminology of Vases
definition: Belly amphora with round handles and round lip.
note: "A variation of the neck-less amphora, characterized by a continuous curve from lip to foot. Shape: The shape is similar to Type B , but with a convex (rolled) lip, and either a torus or an inverted echinus foot. History: This form is especially popular in the third quarter of the sixth century with the black-figure painter known as the Affecter, who also paints neck amphorae. The shape continues in red-figure pottery from about 520 to 450 B.C. In black-figure the decoration is confined to the two panels which appear on the front and the reverse of the vessel. Sometimes the zone above the foot-disc is reserved and contains a band of upright rays. In red-figure, the panel is abandoned in favour of a figure placed in silhouette against the black ground of the body of the vessel." http:www.perseus.tufts.eduhoppertext?doc=Perseus:text:1999.04.0004:id=type-c-amphora
label: αμφορέας τύπου Γ @el
definition: Αμφορέας με στρογγυλές λαβές και κοιλιά με στρογγυλό χείλος, . @el
broader: belly amphora
type: Class
subclass of: belly amphora
disjoint with: type A amphora
disjoint with: type B amphora
subclass of: Restriction
  on property: ownDifference
  has value: with round lip
subclass of: Restriction
  on property: ownDifference
  has value: with round handles
conceptName: <Vessel for storing and transport with neck with handles with two handles liquid or solid with foot without a clearly defined neck with standard belly with round lip with round handles>
isA: belly amphora
ownDifference: with round lip
ownDifference: with round handles
inheritedDifference: with standard belly
inheritedDifference: without a clearly defined neck
inheritedDifference: with foot
inheritedDifference: liquid or solid
inheritedDifference: with two handles
inheritedDifference: with handles
inheritedDifference: with neck
inheritedDifference: for storing and transport
inheritedDifference: vessel
difference: with round handles
difference: with round lip
difference: with standard belly
difference: without a clearly defined neck
difference: with foot
difference: liquid or solid
difference: with two handles
difference: with handles
difference: with neck
difference: for storing and transport
difference: vessel
found at: lieu
attribute: date
attribute: diameter
attribute: height
attribute: type of material
attribute: provenance
attribute: vase number in Beazley
attribute: fabric
attribute: technique
attribute: attributed to
attribute: decoration
attribute: current collection
attribute: previous collection
attribute: publication record
attribute: LIMC ID
attribute: pleiades coordinates
denotedByTerm: type C amphora
denotedByTerm: αμφορέας τύπου Γ

type A amphora
type: Concept
in scheme: Ontoterminology of Vases
definition: Belly amphora with flat handles and straight lip.
note: "During the third quarter of the sixth century, a new, more elaborate type is introduced. Type A amphorae are recognisable by their flat, flanged handles, often decorated with ivy, and two-part ('stepped') foot." https:www.beazley.ox.ac.uktoolspotteryshapesbelly.htm
note: "History: The large neck amphora of the late seventh century is derived from the Protoattic shape and continues to be a popular shape, though in a much smaller version, in both black and red figure pottery. The earliest examples of the type A amphora vary as to the shape of the foot and the mouth, always undergoing remodelling and refinement. The usual form in the first half of the sixth century has a small egg-shaped body, tapering at the foot. There are simple cylindrical handles looped from the shoulder to the mid-neck. Soon after the mid-century, the common form has triple-reeded handles , and the body's center of gravity is a bit higher. But once the shape was evolved and became standardized, the lip was echinus-shaped and the foot torus. It enjoyed great popularity during the late period of black figure, lasting from the second quarter of the sixth century down to about 440 B.C. A more elaborate version of the older neck-less amphora, Type B, is the Type A. This shape appears about 550 B.C. and lasts to about 450 B.C. It is thought that the potter Exekias was responsible for the development of this shape (he worked on both neck-less and neck amphorae). The lip is distinctly concave, and the neck and the shoulder are slightly longer. The belly is less tense than that of the Type B amphora. The strap handles have flanges and decorated edges (usually an ivy tendril). The foot is in two degrees, the lower with a convex profile and the upper with a vertical edge. There is a fillet between the foot and the base of the body. The decoration consists of two panels, one on the front, and one on the reverse, of the vases. They are set a bit lower on the body than on the Type B amphora. Sometimes a palmette appears in a reserved zone below each handle." http:www.perseus.tufts.eduhoppertext?doc=Perseus:text:1999.04.0004:id=type-a-amphora
label: αμφορέας τύπου Α @el
definition: Αμφορέας με επίπεδες λαβές και κοιλιά με ίσιο στόμιο . @el
broader: belly amphora
type: Class
subclass of: belly amphora
disjoint with: type C amphora
disjoint with: type B amphora
subclass of: Restriction
  on property: ownDifference
  has value: with straight lip
subclass of: Restriction
  on property: ownDifference
  has value: with flat handles
conceptName: <Vessel for storing and transport with neck with handles with two handles liquid or solid with foot without a clearly defined neck with standard belly with straight lip with flat handles>
isA: belly amphora
ownDifference: with straight lip
ownDifference: with flat handles
inheritedDifference: with standard belly
inheritedDifference: without a clearly defined neck
inheritedDifference: with foot
inheritedDifference: liquid or solid
inheritedDifference: with two handles
inheritedDifference: with handles
inheritedDifference: with neck
inheritedDifference: for storing and transport
inheritedDifference: vessel
difference: with flat handles
difference: with straight lip
difference: with standard belly
difference: without a clearly defined neck
difference: with foot
difference: liquid or solid
difference: with two handles
difference: with handles
difference: with neck
difference: for storing and transport
difference: vessel
found at: lieu
attribute: date
attribute: diameter
attribute: height
attribute: type of material
attribute: provenance
attribute: vase number in Beazley
attribute: fabric
attribute: technique
attribute: attributed to
attribute: decoration
attribute: current collection
attribute: previous collection
attribute: publication record
attribute: LIMC ID
attribute: pleiades coordinates
denotedByTerm: type A amphora
denotedByTerm: αμφορέας τύπου Α

lieu
type: Concept
in scheme: Ontoterminology of Vases
top concept of: Ontoterminology of Vases
broad match: E53 Place
type: Class
disjoint with: Material
disjoint with: personne
disjoint with: vase
subclass of: Restriction
  on property: ownDifference
  has value: place
subclass of: Restriction
  on property: latitude
  some values from: decimal
subclass of: Restriction
  on property: longitude
  some values from: decimal
conceptName: <Place>
ownDifference: place
difference: place
attribute: latitude
attribute: longitude
denotedByTerm: lieu

column krater
type: Concept
in scheme: Ontoterminology of Vases
definition: Krater with a clearly defined neck and column-like handles.
note: "Named for its column-like handles, the column-krater is first known from Corinthian examples dated to the late seventh century. It is regularly produced by Athenian potters from the first half of the sixth-century until the third quarter of the fifth. It seems from graffiti on Athenian red-figure examples that the vessel was referred to as Korinthios or Korinthiourges." Classical Art Research Centre, University of Oxford. Accessible online: https:www.beazley.ox.ac.uktoolspotteryshapescolumn.htm 2020 05 08
label: cratère à colonnettes @fr
definition: Cratère avec cou, avec des anses en forme de colonne. @fr
label: κρατήρας κιονωτός @el
definition: Κρατήρας με κιονωτές λαβές και ευδιάκριτο λαιμό. @el
broader: Vessel for mixing wine with water with handles with foot with open mouth with neck with a clearly defined neck
type: Class
subclass of: Vessel for mixing wine with water with handles with foot with open mouth with neck with a clearly defined neck
disjoint with: volute krater
subclass of: Restriction
  on property: ownDifference
  has value: with column-like handles
conceptName: <Vessel for mixing wine with water with handles with foot with open mouth with neck with a clearly defined neck with column-like handles>
isA: Vessel for mixing wine with water with handles with foot with open mouth with neck with a clearly defined neck
ownDifference: with column-like handles
inheritedDifference: with a clearly defined neck
inheritedDifference: with neck
inheritedDifference: with open mouth
inheritedDifference: with foot
inheritedDifference: with handles
inheritedDifference: for mixing wine with water
inheritedDifference: vessel
difference: with column-like handles
difference: with a clearly defined neck
difference: with neck
difference: with open mouth
difference: with foot
difference: with handles
difference: for mixing wine with water
difference: vessel
found at: lieu
attribute: date
attribute: diameter
attribute: height
attribute: type of material
attribute: provenance
attribute: vase number in Beazley
attribute: fabric
attribute: technique
attribute: attributed to
attribute: decoration
attribute: current collection
attribute: previous collection
attribute: publication record
attribute: LIMC ID
attribute: pleiades coordinates
denotedByTerm: column krater
denotedByTerm: cratère à colonnettes
denotedByTerm: κρατήρας κιονωτός

type B amphora
type: Concept
in scheme: Ontoterminology of Vases
definition: Belly amphora with round handles and straight lip.
note: "The most typically occurring form is termed Type B, characterised by the combination of round handles, the mouth's straight lip, and the convex profile of the one-piece foot (termed 'echinus'). The shape is old, dating back to the seventh century, and continuing to be produced until the mid-fifth century." https:www.beazley.ox.ac.uktoolspotteryshapesbelly.htm
note: "A variation of the neck-less amphora, characterized by a continuous curve from lip to foot. Shape: It is characterized by a straight or slightly concave lip, an inverted echinus foot, and plain cylindrical looped handles, which reach from the sloping shoulder to the middle of the neck. History: A variation of the one-piece amphora, Type B was introduced by 610 B.C. , and is the earliest in the sequence with this series of amphorae which form a continuous curve from the lip to the foot. The decoration was confined to the two panels, one on the front and one on the reverse of the vase. Above these panels appears a floral chain. Above the foot is a reserved frieze which contains a band of rays. It lasts to the third quarter of the fifth century B.C." http:www.perseus.tufts.eduhoppertext?doc=Perseus:text:1999.04.0004:id=type-b-amphora
label: αμφορέας τύπου Β @el
definition: Αμφορέας με στρογγυλές λαβές και κοιλιά με ίσιο στόμιο, . @el
broader: belly amphora
type: Class
subclass of: belly amphora
disjoint with: type A amphora
disjoint with: type C amphora
subclass of: Restriction
  on property: ownDifference
  has value: with straight lip
subclass of: Restriction
  on property: ownDifference
  has value: with round handles
conceptName: <Vessel for storing and transport with neck with handles with two handles liquid or solid with foot without a clearly defined neck with standard belly with straight lip with round handles>
isA: belly amphora
ownDifference: with straight lip
ownDifference: with round handles
inheritedDifference: with standard belly
inheritedDifference: without a clearly defined neck
inheritedDifference: with foot
inheritedDifference: liquid or solid
inheritedDifference: with two handles
inheritedDifference: with handles
inheritedDifference: with neck
inheritedDifference: for storing and transport
inheritedDifference: vessel
difference: with round handles
difference: with straight lip
difference: with standard belly
difference: without a clearly defined neck
difference: with foot
difference: liquid or solid
difference: with two handles
difference: with handles
difference: with neck
difference: for storing and transport
difference: vessel
found at: lieu
attribute: date
attribute: diameter
attribute: height
attribute: type of material
attribute: provenance
attribute: vase number in Beazley
attribute: fabric
attribute: technique
attribute: attributed to
attribute: decoration
attribute: current collection
attribute: previous collection
attribute: publication record
attribute: LIMC ID
attribute: pleiades coordinates
denotedByTerm: type B amphora
denotedByTerm: αμφορέας τύπου Β

krater
type: Concept
in scheme: Ontoterminology of Vases
definition: Large open container with a foot and handles, used in ancient Greece for mixing wine with water.
note: LSJ (Perseus): mixing vessel, esp. bowl, in which wine was mixed with water. Accessible online: http:www.perseus.tufts.eduhoppertext?doc=Perseus%3Atext%3A1999.04.0057%3Aentry%3Dkrath%2Fr
note: The term 'krater' suggests a mixing-vessel (compare Greek kerannumi - to mix), and we know that the wine served at the symposium was mixed with water. On vases decorated with symposium-scenes, a large open container with a foot is often depicted, and the name krater is appropriate. Examples can be traced back to the large Geometric examples that were used as grave-markers, and this funerary connection continues to be important. Excavations of burial-sites have shown that they could be used in Greek settlements overseas as containers of ashes, and South Italian, especially Apulian, volute-kraters often carry explicit funerary iconography. In the Athenian repertoire, there are four main types identified today: column-, volute-, calyx- and bell-. The psykter is a short-lived shape, used to cool the liquid. It is discussed here because it is often shown being used in kraters. http:www.beazley.ox.ac.uktoolspotteryshapeskraters.htm (2020 05 08)
example: Hom. Il. 23.741 Πηλεΐδης δ᾽ αἶψ᾽ ἄλλα τίθει ταχυτῆτος ἄεθλα ἀργύρεον κρητῆρα τετυγμένον: ἓξ δ᾽ ἄρα μέτρα χάνδανεν, αὐτὰρ κάλλει ἐνίκα πᾶσαν ἐπ᾽ αἶαν πολλόν, ἐπεὶ Σιδόνες πολυδαίδαλοι εὖ ἤσκησαν, Φοίνικες δ᾽ ἄγον ἄνδρες ἐπ᾽ ἠεροειδέα πόντον, 745 στῆσαν δ᾽ ἐν λιμένεσσι, Θόαντι δὲ δῶρον ἔδωκαν Accessible online: http:www.perseus.tufts.eduhoppertext?doc=Perseus:abo:tlg,0012,001:23:741&lang=original
example: κρα-τήρ , Ion.and Ep. κρητήρ , ῆρος, ὁ, (κεράννυμι) A.mixing vessel, esp. bowl, in which wine was mixed with water, κ. ἀργύρεος, χρύσεος, Il.23.741,219; [“κ.] ἀργύρεος ἔστιν ἅπας, χρυσῷ δ᾽ ἐπὶ χείλεα κεκράανται” Od.4.615; “οἶνον δ᾽ ἐκ κρητῆρος ἀφυσσόμενοι δεπάεσσιν ἔκχεον” Il.3.295, cf. 247; κρητῆρι δὲ οἶνον μίσγον ib.269; “κρητῆρα κερασσάμενος” Od.7.179, 13.50; “οἶνον ἔμισγον ἐνὶ κρητῆρσι καὶ ὕδωρ” 1.110, cf.Sapph.51, Alc. 45, S.OC159 (lyr.), Ar.Ec.841; κρατῆρα κεράσαι Orac. ap. D.21.53, cf. Th.6.32; “κρητῆρα καὶ ὑποκρητήριον” SIG2 (Sigeum, vi B.C.); πίνοντες κρητῆρας drinking bowls of wine, Il.8.232; κρητῆρα στήσασθαι ἐλεύθερον to set up a bowl of wine to be drunk in honour of the deliverance 6.528, cf. Od.2.431; κρητῆρα ἐπιστέψασθαι ποτοῖο, v. ἐπιστέφω; κρατῆρος μέρος μετασχεῖν A.Ch.291; “σπονδὴ τρίτου κρατῆρος” S.Fr. 425. Henry George Liddell, Robert Scott, A Greek-English Lexicon http:www.perseus.tufts.edu 2020 05 08
label: cratère @fr
definition: Vase pour mélanger le vin avec de l'eau. @fr
label: κρατήρας @el
definition: Αγγείο με λαβές, πόδι, ανοικτό στόμιο για τη μείξη οίνου και ύδατος @el
note: --- new note --- @el
label: κρατήρ @el
definition: Αγγείο για τη μείξη οίνου και ύδατος, με λαβές, πόδι και ανοικτό στόμιο. @el
broader: vase
narrower: Vessel for mixing wine with water with handles with foot with open mouth with neck with a clearly defined neck
narrower: Vessel for mixing wine with water with handles with foot with open mouth without neck
type: Class
subclass of: vase
disjoint with: lekythos
disjoint with: panathenaic prize amphora
disjoint with: amphora
disjoint with: hydria
subclass of: Restriction
  on property: ownDifference
  has value: for mixing wine with water
subclass of: Restriction
  on property: ownDifference
  has value: with handles
subclass of: Restriction
  on property: ownDifference
  has value: with foot
subclass of: Restriction
  on property: ownDifference
  has value: with open mouth
conceptName: <Vessel for mixing wine with water with handles with foot with open mouth>
isA: vase
ownDifference: for mixing wine with water
ownDifference: with handles
ownDifference: with foot
ownDifference: with open mouth
inheritedDifference: vessel
difference: with open mouth
difference: with foot
difference: with handles
difference: for mixing wine with water
difference: vessel
found at: lieu
attribute: date
attribute: diameter
attribute: height
attribute: type of material
attribute: provenance
attribute: vase number in Beazley
attribute: fabric
attribute: technique
attribute: attributed to
attribute: decoration
attribute: current collection
attribute: previous collection
attribute: publication record
attribute: LIMC ID
attribute: pleiades coordinates
denotedByTerm: krater
denotedByTerm: cratère
denotedByTerm: κρατήρας
denotedByTerm: κρατήρ

vase
type: Concept
in scheme: Ontoterminology of Vases
top concept of: Ontoterminology of Vases
definition: Ceramic vessel.
definition: Récipient, de matière, de grandeur et de forme variables. @fr
note: 1. Récipient de grandeur et de forme variables servant à différents usages ou ayant valeur historique, artistique. TLFi 20190113 @fr
label: αγγείο @el
narrower: krater
narrower: lekythos
narrower: amphora
narrower: hydria
narrower: panathenaic prize amphora
related: lieu
broad match: E24 Physical Man-Made Thing
type: Class
disjoint with: Material
disjoint with: personne
disjoint with: lieu
subclass of: Restriction
  on property: ownDifference
  has value: vessel
subclass of: Restriction
  on property: foundAt
  some values from: lieu
subclass of: Restriction
  on property: date
  some values from: dateTime
subclass of: Restriction
  on property: diameter
  some values from: decimal
subclass of: Restriction
  on property: height
  some values from: decimal
subclass of: Restriction
  on property: type of material
  some values from: string
subclass of: Restriction
  on property: provenance
  some values from: string
subclass of: Restriction
  on property: vase number in Beazley
  some values from: decimal
subclass of: Restriction
  on property: fabric
  some values from: string
subclass of: Restriction
  on property: technique
  some values from: string
subclass of: Restriction
  on property: attributed to
  some values from: string
subclass of: Restriction
  on property: decoration
  some values from: string
subclass of: Restriction
  on property: current collection
  some values from: string
subclass of: Restriction
  on property: previous collection
  some values from: string
subclass of: Restriction
  on property: publication record
  some values from: string
subclass of: Restriction
  on property: LIMC ID
  some values from: string
subclass of: Restriction
  on property: pleiades coordinates
  some values from: string
conceptName: <Vessel>
ownDifference: vessel
difference: vessel
found at: lieu
attribute: date
attribute: diameter
attribute: height
attribute: type of material
attribute: provenance
attribute: vase number in Beazley
attribute: fabric
attribute: technique
attribute: attributed to
attribute: decoration
attribute: current collection
attribute: previous collection
attribute: publication record
attribute: LIMC ID
attribute: pleiades coordinates
denotedByTerm: vase
denotedByTerm: αγγείο

Material
type: Concept
in scheme: Ontoterminology of Vases
top concept of: Ontoterminology of Vases
narrower: Clay
type: Class
disjoint with: personne
disjoint with: lieu
disjoint with: vase
subclass of: Restriction
  on property: ownDifference
  has value: material
conceptName: <Material>
ownDifference: material
difference: material

Vessel for storing and transport with neck with handles with two handles liquid or solid without foot
type: Concept
in scheme: Ontoterminology of Vases
broader: amphora
type: Class
subclass of: amphora
disjoint with: Vessel for storing and transport with neck with handles with two handles liquid or solid with foot
subclass of: Restriction
  on property: ownDifference
  has value: without foot
conceptName: <Vessel for storing and transport with neck with handles with two handles liquid or solid without foot>
isA: amphora
ownDifference: without foot
inheritedDifference: liquid or solid
inheritedDifference: with two handles
inheritedDifference: with handles
inheritedDifference: with neck
inheritedDifference: for storing and transport
inheritedDifference: vessel
difference: without foot
difference: liquid or solid
difference: with two handles
difference: with handles
difference: with neck
difference: for storing and transport
difference: vessel
found at: lieu
attribute: date
attribute: diameter
attribute: height
attribute: type of material
attribute: provenance
attribute: vase number in Beazley
attribute: fabric
attribute: technique
attribute: attributed to
attribute: decoration
attribute: current collection
attribute: previous collection
attribute: publication record
attribute: LIMC ID
attribute: pleiades coordinates

hasPart
type: ObjectProperty
domain: Thing
range: Thing
type: Relation

relatedTo
type: ObjectProperty
domain: Thing
range: Thing
type: Relation

foundAt
type: ObjectProperty
domain: Class
  union of: vase
range: Class
  union of: lieu
type: Relation

type of material
type: DatatypeProperty
domain: Class
  union of: vase
range: string
type: Attribute

attributed to
type: DatatypeProperty
domain: Class
  union of: vase
range: string
type: Attribute

fabric
type: DatatypeProperty
domain: Class
  union of: vase
range: string
type: Attribute

vase number in Beazley
type: DatatypeProperty
domain: Class
  union of: vase
range: decimal
type: Attribute

LIMC ID
type: DatatypeProperty
domain: Class
  union of: vase
range: string
type: Attribute

previous collection
type: DatatypeProperty
domain: Class
  union of: vase
range: string
type: Attribute

longitude
type: DatatypeProperty
domain: Class
  union of: lieu
range: decimal
type: Attribute

date
type: DatatypeProperty
domain: Class
  union of: vase
type: Attribute

current collection
type: DatatypeProperty
domain: Class
  union of: vase
range: string
type: Attribute

provenance
type: DatatypeProperty
domain: Class
  union of: vase
range: string
type: Attribute

technique
type: DatatypeProperty
domain: Class
  union of: vase
range: string
type: Attribute

pleiades coordinates
type: DatatypeProperty
domain: Thing
range: string
type: Attribute

diameter
type: DatatypeProperty
domain: Class
  union of: vase
range: decimal
type: Attribute

publication record
type: DatatypeProperty
domain: Class
  union of: vase
range: string
type: Attribute

height
type: DatatypeProperty
domain: Class
  union of: vase
range: decimal
type: Attribute

decoration
type: DatatypeProperty
domain: Class
  union of: vase
range: string
type: Attribute

latitude
type: DatatypeProperty
domain: Class
  union of: lieu
range: decimal
type: Attribute

Beazley-218134
type: NamedIndividual
type: calyx krater
technique: RED-FIGURE
type: Object
instanceOf: calyx krater

Beazley-8013
type: NamedIndividual
type: hydria
technique: RED-FIGURE
decoration: Body:_EROS_WITH_KROTALA_BETWEEN_MAENAD_?_WITH_PIPES_SEATED_ON_ROCK_AND_MAENAD_?_DANCING,_PAN
publication record: Charisterion_es_Anastasion_Orlandon_(Athens,_1965-68):_I,_AT_176,_PLS.5-8_PHOTOGRAPH(S)_IN_THE_BEAZLEY_ARCHIVE:_7
date: -400_to_-300
current collection: Athens,_National_Museum:_19500
fabric: ATHENIAN
type: Object
instanceOf: hydria

Beazley-218176
type: NamedIndividual
type: calyx krater
technique: RED-FIGURE
type: Object
instanceOf: calyx krater

Beazley-218268
type: NamedIndividual
type: calyx krater
technique: RED-FIGURE
type: Object
instanceOf: calyx krater

Beazley-402
type: NamedIndividual
type: hydria
technique: RED-FIGURE
decoration: EROTIC,_MEN,_ONE_LYING_ON_TABLE,_SOME_HOLDING_NAKED_WOMAN
publication record: Marcade,_J.,_Eros_Kalos_(Geneva,_1962):_137_Peschel,_I.,_Die_Hetare_bei_Symposium_und_Komos_in_der_attisch_rotfigurigen_Malerei_des_6.-4._Jhs._v.Chr._(Frankfurt,_1987):_PL.246
current collection: Athens,_National_Museum
fabric: ATHENIAN
type: Object
instanceOf: hydria

Beazley-260037
type: NamedIndividual
type: bell krater
technique: RED-FIGURE
type: Object
instanceOf: bell krater

Beazley-7951
type: NamedIndividual
type: calyx krater
technique: RED-FIGURE
type: Object
instanceOf: calyx krater

Beazley-216173
type: NamedIndividual
type: column krater
technique: RED-FIGURE
type: Object
instanceOf: column krater

Beazley-7993
type: NamedIndividual
type: hydria
technique: RED-FIGURE
decoration: PLEIADES_(?)_WOMEN,_SOME_SEATED,_ONE_WITH_ALABASTRON,_ONE_WITH_SPRIG,_BOX_PALM_TREE
publication record: Ephemeris_Archaiologike:_1945-47,_PLS.1-2
publication record: Lexicon_Iconographicum_Mythologiae_Classicae:_II,_PL.680,_ASTRA_89_Schefold,_K.,_Jung,_F.,_Die_Urkonige,_Perseus,_Bellerophon,_Herakles_und_Theseus_in_der_klassischen_und_hellenistischen_Kunst_(Munich,_1988):_166,_FIG.201_(DRAWING)_Torelli,_M.,_Semainein,_Significare,_Scritti_vari_di_ermeneutica_archeologica,_a_cura_di_Angela_Sciarma_(Pisa_and_Rome,_2012):_415,_FIG.42_(DRAWING)
LIMC ID: 40939
date: -425_to_-375
current collection: Athens,_National_Museum:_17469
fabric: ATHENIAN
type: Object
instanceOf: hydria

Beazley-31357
type: NamedIndividual
type: bell krater
decoration: A:_ATHLETES,_ONE_WITH_STRIGIL,_ONE_WITH_ARYBALLOS,_TRAINER
technique: RED-FIGURE
publication record: Tuna-Norling,_Y.,_Daskyleion_I,_Die_attische_Keramik_(Izmir,_1999):_59_(COLOUR_OF_A)
publication record: Tzachou-Alexandri,_O.,_Mind_and_Body:_Athletic_Contests_in_Ancient_Greece_(Athens,_1988):_170,_NO.56_(A)
date: -425_to_-375
current collection: Athens,_National_Museum:_17920
type: Object
instanceOf: bell krater
denotedByProperName: Beazley-31357 en

Beazley-300776
type: NamedIndividual
type: column krater
technique: BLACK-FIGURE
type: Object
instanceOf: column krater

Beazley-218213
type: NamedIndividual
type: calyx krater
technique: RED-FIGURE
type: Object
instanceOf: calyx krater

Beazley-217564
type: NamedIndividual
type: bell krater
technique: RED-FIGURE
decoration: A:_APOLLO_WITH_LAUREL,_AND_MARSYAS_SEATED_AT_TREE_PLAYING_PIPES,_ARTEMIS_WITH_TORCH,_ATHENA,_NIKE_WITH_SASH,_HYDRIA_B:_DRAPED_SATYR_AND_MAENADS_WITH_THYRSOI_
publication record: Beazley,_J.D.,_Attic_Red-Figure_Vase-Painters,_2nd_edition_(Oxford,_1963):_1343.2_Carpenter,_T.H.,_with_Mannack,_T.,_and_Mendonca,_M.,_Beazley_Addenda,_2nd_edition_(Oxford,_1989):_367_Heinemann,_A.,_Der_Gott_des_Gelages._Dionysos,_Satyrn_und_Manaden_auf_attischem_Trinkgeschirr_des_5._Jahrhunderts_v._Chr._(Berlin,_2016):_308,_FIG.195_(DRAWING_OF_A)_
vase number in beazley: 217564
date: -425_to_-375
current collection: Athens,_National_Museum:_1442
fabric: ATHENIAN
provenance: Crete
previous collection: Athens,_National_Museum:_CC1921
attributed to: SEMELE_P_by_SMITH
type: Object
instanceOf: bell krater
denotedByProperName: Beazley-217564 en

Beazley-30217
type: NamedIndividual
type: bell krater
decoration: A:_DIONYSOS_WITH_KANTHAROS_AND_THYRSOS,_ORIENTAL_DANCING,_SATYR_PLAYING_AULOS
technique: RED-FIGURE
publication record: Corpus_Vasorum_Antiquorum:_FERRARA,_MUSEO_NAZIONALE_2,_III.H.17,_PL.(2146)_21.1,3
publication record: Dumont,_A._&_Chaplain,_J.,_Les_ceramiques_de_la_Grece_propre_(Paris,_1888):_I,_PL._17_(DRAWING)
publication record: Giudice,_F._and_Panvini,_R._(eds.),_Il_greco,_il_barbaro_e_la_ceramica_attica,_Immaginario_del_diverso,_processi_di_scambio_e_autorappresentazione_degli_indigeni,_Volume_terzo,_Atti_del_Convegno_Internazionale_di_Studi,_14-19_maggio_2001,_Catania,_Caltanisetta,_Gela,_Camarina,_Vittoria,_Siracusa_(Rome,_2006):_136,_FIG.14_(DRAWING_OF_A)
publication record: Todisco,_L.,_Pittura_e_ceramica_figurata_tra_Grecia,_Magna_Grecia_e_Sicilia_(Bari_and_Rome,_2006):_138,_FIG.14_(DRAWING_OF_A)
date: -450_to_-400
current collection: Athens,_National_Museum:_CC1923
fabric: ATHENIAN_
provenance: BOEOTIA,_DOMBRENA
previous collection: Athens,_National_Museum:_1387
previous collection: Athens,_National_Museum:_1235
found at: place-38.3466880333,23.1846775333
type: Object
instanceOf: bell krater
denotedByProperName: Beazley-30217 en

Beazley-218276
type: NamedIndividual
type: calyx krater
technique: RED-FIGURE
type: Object
instanceOf: calyx krater

Beazley-214477
type: NamedIndividual
type: bell krater
technique: RED-FIGURE
type: Object
instanceOf: bell krater

Beazley-29583
type: NamedIndividual
type: column krater
technique: RED-FIGURE
type: Object
instanceOf: column krater

Beazley-320329
type: NamedIndividual
type: volute krater
technique: BLACK-FIGURE
type: Object
instanceOf: volute krater

Beazley-10936
type: NamedIndividual
type: calyx krater
technique: RED-FIGURE
type: Object
instanceOf: calyx krater
denotedByProperName: Beazley-10936 en
denotedByProperName: Beazley-10936 fr
denotedByProperName: Beazley-10936 el

Beazley-218204
type: NamedIndividual
type: calyx krater
technique: RED-FIGURE
type: Object
instanceOf: calyx krater

Beazley-218292
type: NamedIndividual
type: calyx krater
technique: RED-FIGURE
type: Object
instanceOf: calyx krater

Beazley-350342
type: NamedIndividual
type: column krater
technique: BLACK-FIGURE
type: Object
instanceOf: column krater

Beazley-218339
type: NamedIndividual
type: bell krater
technique: RED-FIGURE
type: Object
instanceOf: bell krater

Beazley-218103
type: NamedIndividual
type: calyx krater
technique: RED-FIGURE
type: Object
instanceOf: calyx krater
denotedByProperName: Beazley-218103 en

Beazley-310259
type: NamedIndividual
type: column krater
technique: BLACK-FIGURE
type: Object
instanceOf: column krater

Beazley-215301
type: NamedIndividual
type: bell krater
technique: RED-FIGURE
type: Object
instanceOf: bell krater

Beazley-218283
type: NamedIndividual
type: calyx krater
technique: RED-FIGURE
type: Object
instanceOf: calyx krater

Beazley-218074
type: NamedIndividual
type: calyx krater
technique: RED-FIGURE
type: Object
instanceOf: calyx krater

Beazley-11089
type: NamedIndividual
type: calyx krater
technique: RED-FIGURE
type: Object
instanceOf: calyx krater

place-35.2198443917,24.9957699715
type: NamedIndividual
type: lieu
note: Crete Greece
latitude: 35.2198
longitude: 24.9958
type: Object
instanceOf: lieu
denotedByProperName: Crete en

Beazley-42062
type: NamedIndividual
type: calyx krater
technique: RED-FIGURE
type: Object
instanceOf: calyx krater

Beazley-31356
type: NamedIndividual
type: bell krater
decoration: A:_ATHLETES,_YOUTHS,_ONE_POURING_OIL_FROM_ARYBALLOS,_ONE_WITH_STRIGIL,_ARYBALLOI_AND_STRIGIL_SUSPENDED,_CLOTHES_ON_POSTS
technique: RED-FIGURE
publication record: Giudice_E._and_Giudice,_G._(eds.),_Studi_miscellanei_di_ceramografia_Greca_III_(Catania,_2017):_67,_PL.7,_FIGS.24-25_(COLOUR_OF_A_AND_B)
publication record: Stampolidis,_N.Ch._and_Tassoulas,_Y.,_Hygieia._Health,_Illness,_Treatment_from_Homer_to_Galen_(Athens,_2014):_115,_NO.12_(COLOUR_OF_A)
publication record: Tzachou-Alexandri,_O.,_Mind_and_Body:_Athletic_Contests_in_Ancient_Greece_(Athens,_1988):_171,_NO.57_(A)
date: -400_to_-300
current collection: Athens,_National_Museum:_18797
fabric: ATHENIAN
previous collection: Athens,_Empedokles
attributed to: ERLANGEN_SYMPOSION,_P_OF*_by_MCPHEE
type: Object
instanceOf: bell krater
denotedByProperName: Beazley-31356 en

Beazley-215717
type: NamedIndividual
type: bell krater
technique: RED-FIGURE
type: Object
instanceOf: bell krater

Beazley-300350
type: NamedIndividual
type: column krater
technique: BLACK-FIGURE
type: Object
instanceOf: column krater

Beazley-218182
type: NamedIndividual
type: calyx krater
technique: RED-FIGURE
type: Object
instanceOf: calyx krater

Beazley-218065
type: NamedIndividual
type: bell krater
technique: RED-FIGURE
decoration: B:_DRAPED_YOUTHS_A:_MAENAD_SEATED_WITH_TYMPANON,_SATYRS,_YOUNG_SATYR_
publication record: Beazley,_J.D.,_Attic_Red-Figure_Vase-Painters,_2nd_edition_(Oxford,_1963):_1437.6_Kathariou,_K.,_To_ergasterio_tou_zographou_tou_Meleagrou_kai_he_epoche_tou:_paratereseis_sten_attike_keramike_tou_protou_tetartou_tou_4_ou_ai._p.Ch._(Thessaloniki,_2002):_366,_435,_FIG.20A_(DRAWING_OF_PROFILE),_PL.84B-C_(A,B)_
vase number in beazley: 218065
date: -400-300
current collection: Athens,_National_Museum:_12197
fabric: ATHENIAN
provenance: GREECE,_BOEOTIA
attributed to: UPSALA_P_by_BEAZLEY
found at: place-38.3466880333,23.1846775333
type: Object
instanceOf: bell krater
denotedByProperName: Beazley-218065 en

Beazley-9033487
type: NamedIndividual
type: bell krater
technique: RED-FIGURE
type: Object
instanceOf: bell krater

Beazley-216071
type: NamedIndividual
type: column krater
technique: RED-FIGURE
type: Object
instanceOf: column krater

Beazley-218296
type: NamedIndividual
type: calyx krater
technique: RED-FIGURE
type: Object
instanceOf: calyx krater

Beazley-218203
type: NamedIndividual
type: calyx krater
technique: RED-FIGURE
type: Object
instanceOf: calyx krater

Beazley-9016793
type: NamedIndividual
type: column krater
technique: BLACK-FIGURE
type: Object
instanceOf: column krater

Beazley-218153
type: NamedIndividual
type: calyx krater
technique: RED-FIGURE
type: Object
instanceOf: calyx krater
denotedByProperName: Beazley-218153 en

Beazley-218291
type: NamedIndividual
type: calyx krater
technique: RED-FIGURE
type: Object
instanceOf: calyx krater

Beazley-216062
type: NamedIndividual
type: bell krater
technique: RED-FIGURE
type: Object
instanceOf: bell krater

Beazley-305083
type: NamedIndividual
type: column krater
technique: BLACK-FIGURE
type: Object
instanceOf: column krater

Beazley-7954
type: NamedIndividual
type: calyx krater
technique: RED-FIGURE
type: Object
instanceOf: calyx krater

Beazley-275760
type: NamedIndividual
type: volute krater
technique: RED-FIGURE
type: Object
instanceOf: volute krater

Beazley-218282
type: NamedIndividual
type: calyx krater
technique: RED-FIGURE
type: Object
instanceOf: calyx krater

Beazley-218073
type: NamedIndividual
type: calyx krater
technique: RED-FIGURE
type: Object
instanceOf: calyx krater
denotedByProperName: Beazley-218073 en

Beazley-218216
type: NamedIndividual
type: calyx krater
technique: RED-FIGURE
type: Object
instanceOf: calyx krater

Beazley-218186
type: NamedIndividual
type: calyx krater
technique: RED-FIGURE
type: Object
instanceOf: calyx krater

Beazley-218308
type: NamedIndividual
type: calyx krater
technique: RED-FIGURE
type: Object
instanceOf: calyx krater

Beazley-218211
type: NamedIndividual
type: calyx krater
technique: RED-FIGURE
type: Object
instanceOf: calyx krater

Beazley-218043
type: NamedIndividual
type: calyx krater
technique: RED-FIGURE
type: Object
instanceOf: calyx krater
denotedByProperName: Beazley-218043 en

Beazley-218324
type: NamedIndividual
type: calyx krater
technique: RED-FIGURE
type: Object
instanceOf: calyx krater

Beazley-9394
type: NamedIndividual
type: hydria
type: Object
instanceOf: hydria

Beazley-218085
type: NamedIndividual
type: calyx krater
technique: RED-FIGURE
type: Object
instanceOf: calyx krater
denotedByProperName: Beazley-218085 en

place-38.253549,22.981339
type: NamedIndividual
type: lieu
note: BOEOTIA, DOMBRENA Pleiades URI: https:pleiades.stoa.orgplaces540689
latitude: 38.2535
longitude: 22.9813
type: Object
instanceOf: lieu

Beazley-218207
type: NamedIndividual
type: calyx krater
technique: RED-FIGURE
type: Object
instanceOf: calyx krater

Beazley-218253
type: NamedIndividual
type: bell krater
technique: RED-FIGURE
type: Object
instanceOf: bell krater

Beazley-10934
type: NamedIndividual
type: calyx krater
technique: RED-FIGURE
type: Object
instanceOf: calyx krater

Beazley-213877
type: NamedIndividual
type: calyx krater
technique: RED-FIGURE
type: Object
instanceOf: calyx krater

Beazley-217511
type: NamedIndividual
type: bell krater
technique: RED-FIGURE
decoration: A:_ATALANTE,_DEVICE,_WREATH
decoration: B:_DIONYSOS_AND_ARIADNE_SEATED,_SATYRS,_ONE_SEATED,_WITH_THYRSOI,_MAENAD,_EROS
publication record: Beazley,_J.D.,_Attic_Red-Figure_Vase-Painters,_2nd_edition_(Oxford,_1963):_1337.7
publication record: Beazley,_J.D.,_Paralipomena_(Oxford,_1971):_481
publication record: Carpenter,_T.H.,_with_Mannack,_T.,_and_Mendonca,_M.,_Beazley_Addenda,_2nd_edition_(Oxford,_1989):_366
publication record: Robertson,_C.M.,_The_art_of_vase-painting_in_classical_Athens_(Cambridge,_1992):_260,_FIG.263
date: -425_to_-375
current collection: Athens,_National_Museum
fabric: ATHENIAN
attributed to: Near_PRONOMOS_P_by_BEAZLEY
found at: place-38.0281126064,22.8528202479
type: Object
instanceOf: bell krater
denotedByProperName: Beazley-217511 en

Beazley-30210
type: NamedIndividual
type: bell krater
decoration: A:_DIONYSOS_WITH_KANTHAROS_AND_THYRSOS,_ORIENTAL_DANCING,_SATYR_PLAYING_AULOS
technique: RED-FIGURE
publication record: Dumont,_A._&_Chaplain,_J.,_Les_ceramiques_de_la_Grece_propre_(Paris,_1888):_I,_PL._17_(DRAWING)
publication record: Giudice,_F._and_Panvini,_R._(eds.),_Il_greco,_il_barbaro_e_la_ceramica_attica,_Immaginario_del_diverso,_processi_di_scambio_e_autorappresentazione_degli_indigeni,_Volume_terzo,_Atti_del_Convegno_Internazionale_di_Studi,_14-19_maggio_2001,_Catania,_Caltanisetta,_Gela,_Camarina,_Vittoria,_Siracusa_(Rome,_2006):_136,_FIG.14_(DRAWING_OF_A)
publication record: Corpus_Vasorum_Antiquorum:_FERRARA,_MUSEO_NAZIONALE_2,_III.H.17,_PL.(2146)_21.1,3
publication record: Todisco,_L.,_Pittura_e_ceramica_figurata_tra_Grecia,_Magna_Grecia_e_Sicilia_(Bari_and_Rome,_2006):_138,_FIG.14_(DRAWING_OF_A)
date: -450_to_-400
current collection: Athens,_National_Museum:_CC1923
fabric: ATHENIAN_
provenance: BOEOTIA,_DOMBRENA
previous collection: Athens,_National_Museum:_1387
previous collection: Athens,_National_Museum:_1235
found at: place-38.3466880333,23.1846775333
type: Object
instanceOf: bell krater
denotedByProperName: Beazley-30210 en

place-37.975,23.7225
type: NamedIndividual
type: lieu
note: Agora of Athens Pleiades URI: https:pleiades.stoa.orgplaces807514119
latitude: 37.975
longitude: 23.7225
type: Object
instanceOf: lieu
denotedByProperName: Agora of Athens en
denotedByProperName: Agora d'Athènes fr
denotedByProperName: Αρχαία Αγορά, Αθήνα el

Beazley-218131
type: NamedIndividual
type: calyx krater
technique: RED-FIGURE
type: Object
instanceOf: calyx krater
denotedByProperName: Beazley-218131 en

Beazley-9017952
type: NamedIndividual
type: bell krater
technique: RED-FIGURE
type: Object
instanceOf: bell krater

Beazley-6730
type: NamedIndividual
type: hydria
technique: BLACK-FIGURE
decoration: Body_1:_LIONS,_GOATS,_FLORAL,_SPHINX_Body_2:_ANIMAL_FRIEZE,_HERMES_(?)_BETWEEN_SPHINXES_BETWEEN_PANTHERS_Body_3:_ANIMAL_FRIEZE,_BIRDS
publication record: Bakir,_G.,_Sophilos_(Mainz,_1981):_PLS.72-75,_FIGS.142-47_(BD,_SIDE,_PARTS)_Bulletin_Antieke_Beschaving:_86_(2011),_18,_FIG.8_(PART_OF_BD)
LIMC ID: 7777
current collection: Athens,_National_Museum:_19191
fabric: ATHENIAN
provenance: ATTICA,_VARI
pleiades coordinates: 37.829758,23.806091
attributed to: Manner_of_SOPHILOS_by_BAKIR
type: Object
instanceOf: hydria

Beazley-217927
type: NamedIndividual
type: calyx krater
technique: RED-FIGURE
type: Object
instanceOf: calyx krater
denotedByProperName: Beazley-217927 en

Beazley-19653
type: NamedIndividual
type: bell krater
note: Vase Number: 19653 Fabric: ATHENIAN Technique: RED-FIGURE Shape Name: KRATER, BELL Provenance: GREECE, BOEOTIA Date: -450 to -400 Decoration: A: SYMPOSIUM, MAN AND YOUTH RECLINING, WOMAN PLAYING PIPES, TABLE WITH FOOD Current Collection: Athens, National Museum: CC1925 Previous Collections: Athens, National Museum: 1380 Publication Record: Mitteilungen des Deutschen Archaologischen Instituts, Athenische Abteilung: 36 (1911), 274, FIG.1 (PART OF A) Pleiades URI: https:pleiades.stoa.orgplaces540689 Coordinates: 38.4666,23.9666 Pleiades Coordinates: 38.3466880333,23.1846775333
decoration: A:_SYMPOSIUM,_MAN_AND_YOUTH_RECLINING,_WOMAN_PLAYING_PIPES,_TABLE_WITH_FOOD
decoration: A:_SYMPOSIUM
technique: RED-FIGURE
publication record: Mitteilungen_des_Deutschen_Archaologischen_Instituts,_Athenische_Abteilung:_36_(1911),_274,_FIG.1_(PART_OF_A)
vase number in beazley: 19653
date: -450_to_-400
current collection: Athens,_National_Museum:_CC1925
fabric: ATHENIAN
provenance: GREECE,_BOEOTIA
previous collection: Athens,_National_Museum:_1380
pleiades coordinates: 38.3466880333,23.1846775333
found at: place-38.3466880333,23.1846775333
type: Object
instanceOf: bell krater
denotedByProperName: Beazley-19653 en

Beazley-218337
type: NamedIndividual
type: bell krater
technique: RED-FIGURE
type: Object
instanceOf: bell krater
denotedByProperName: Beazley-218337 en

Beazley-218101
type: NamedIndividual
type: calyx krater
technique: RED-FIGURE
type: Object
instanceOf: calyx krater
denotedByProperName: Beazley-218101 en

Beazley-300924
type: NamedIndividual
type: column krater
technique: BLACK-FIGURE
type: Object
instanceOf: column krater

Beazley-3030
type: NamedIndividual
type: hydria
technique: BLACK-FIGURE
decoration: Body:_WARRIORS,_ONE_WITH_BOEOTIAN_SHIELD,_FIGHTING_BETWEEN_WOMEN_(ACHILLES_AND_MEMNON_BETWEEN_EOS_AND_THETIS_?),_BIRD_Shoulder:_SPHINX_BETWEEN_LIONS
publication record: Archaiologikon_Deltion:_20.2_(1)_(1965),_PL.83_Bulletin_de_Correspondance_Hellenique:_92_(1968),_766,_FIG.8_NOTES_FROM_BEAZLEY_ARCHIVE_PHOTOGRAPHIC_MOUNT(S):_'FOUND_WITH_LEKYTHOS,_SPHERIC,_OLDER_THAN_THE_EXAMPLES_HASPELS_QUOTES,_CF._LEK._GORGON_PTR.'_[BEAZLEY_TRANSLATION_OF_FRENCH_NOTES_FROM_BACK_OF_PHOTOGRAPH]_PHOTOGRAPH(S)_IN_THE_BEAZLEY_ARCHIVE:_1_(BD,_SH)
publication record: Bulletin_de_Correspondance_Hellenique:_92_(1968),_766,_FIG.8_NOTES_FROM_BEAZLEY_ARCHIVE_PHOTOGRAPHIC_MOUNT(S):_'FOUND_WITH_LEKYTHOS,_SPHERIC,_OLDER_THAN_THE_EXAMPLES_HASPELS_QUOTES,_CF._LEK._GORGON_PTR.'_[BEAZLEY_TRANSLATION_OF_FRENCH_NOTES_FROM_BACK_OF_PHOTOGRAPH]_PHOTOGRAPH(S)_IN_THE_BEAZLEY_ARCHIVE:_1_(BD,_SH)
publication record: NOTES_FROM_BEAZLEY_ARCHIVE_PHOTOGRAPHIC_MOUNT(S):_'FOUND_WITH_LEKYTHOS,_SPHERIC,_OLDER_THAN_THE_EXAMPLES_HASPELS_QUOTES,_CF._LEK._GORGON_PTR.'_[BEAZLEY_TRANSLATION_OF_FRENCH_NOTES_FROM_BACK_OF_PHOTOGRAPH]_PHOTOGRAPH(S)_IN_THE_BEAZLEY_ARCHIVE:_1_(BD,_SH)
date: -575_to_-525
current collection: Athens,_National_Museum
fabric: ATHENIAN
provenance: ATTICA,_ANAGYROUS
pleiades coordinates: 37.8300155,23.804843
previous collection: Unknown,_excavation
attributed to: Compare_GORGON_P_by_UNKNOWN
type: Object
instanceOf: hydria

Beazley-25682
type: NamedIndividual
type: column krater
technique: BLACK-FIGURE
type: Object
instanceOf: column krater

Beazley-5791
type: NamedIndividual
type: hydria
technique: RED-FIGURE
decoration: Body:_DEMETER,_PERSEPHONE_WITH_TORCHES,_DIONYSOS_SEATED_ABOVE_OMPHALOS,_IACCHOS_(?),_WOMEN
publication record: Bianchi,_U.,_The_Greek_Mysteries_(Leiden,_1976):_FIG.7_Bulletin_Antieke_Beschaving:_88_(2013),_151,_FIG.30B.HY12_(PART_OF_BD)_Bulletin_de_Correspondance_Hellenique:_68-69_(1944-5),_327,_FIG.11_(DRAWING)_Clinton,_K.,_Myth_and_Cult,_The_Iconography_of_the_Eleusinian_Mysteries_(Stockholm,_1992):_196,_FIGS.56-57_Herrmann,_H-V.,_Omphalos_(Munster,_1959):_PL.11.6_Lexicon_Iconographicum_Mythologiae_Classicae:_IV,_PL.591,_DEMETER_396_Metzger,_H.,_(ed.),_Eidolopoiia,_Actes_du_Colloque_sur_les_Problemes_de_l'_Image_dans_le_Monde_Medit._Class._(Rome,_1985):_PL.3,_FIG.4._Metzger,_H.,_Les_representations_dans_la_ceramique_attique_du_IVe_siecle_(Paris,_1951):_PL.34.3_Metzger,_H.,_Recherches_sur_l'imagerie_athenienne_(Paris,_1965):_PL.19.1_Revue_Archeologique:_1995,_14,_FIG.7_(PART)
publication record: Bulletin_Antieke_Beschaving:_88_(2013),_151,_FIG.30B.HY12_(PART_OF_BD)_Bulletin_de_Correspondance_Hellenique:_68-69_(1944-5),_327,_FIG.11_(DRAWING)_Clinton,_K.,_Myth_and_Cult,_The_Iconography_of_the_Eleusinian_Mysteries_(Stockholm,_1992):_196,_FIGS.56-57_Herrmann,_H-V.,_Omphalos_(Munster,_1959):_PL.11.6_Lexicon_Iconographicum_Mythologiae_Classicae:_IV,_PL.591,_DEMETER_396_Metzger,_H.,_(ed.),_Eidolopoiia,_Actes_du_Colloque_sur_les_Problemes_de_l'_Image_dans_le_Monde_Medit._Class._(Rome,_1985):_PL.3,_FIG.4._Metzger,_H.,_Les_representations_dans_la_ceramique_attique_du_IVe_siecle_(Paris,_1951):_PL.34.3_Metzger,_H.,_Recherches_sur_l'imagerie_athenienne_(Paris,_1965):_PL.19.1_Revue_Archeologique:_1995,_14,_FIG.7_(PART)
publication record: Clinton,_K.,_Myth_and_Cult,_The_Iconography_of_the_Eleusinian_Mysteries_(Stockholm,_1992):_196,_FIGS.56-57
publication record: Herrmann,_H-V.,_Omphalos_(Munster,_1959):_PL.11.6
publication record: Lexicon_Iconographicum_Mythologiae_Classicae:_IV,_PL.591,_DEMETER_396
publication record: Metzger,_H.,_(ed.),_Eidolopoiia,_Actes_du_Colloque_sur_les_Problemes_de_l'_Image_dans_le_Monde_Medit._Class._(Rome,_1985):_PL.3,_FIG.4.
publication record: Metzger,_H.,_Les_representations_dans_la_ceramique_attique_du_IVe_siecle_(Paris,_1951):_PL.34.3
publication record: Metzger,_H.,_Recherches_sur_l'imagerie_athenienne_(Paris,_1965):_PL.19.1
vase number in beazley: 5791
LIMC ID: 6730
date: -400_to_-300
current collection: Athens,_National_Museum:_CC1851
fabric: ATHENIAN
provenance: Greece,_Crete
previous collection: Athens,_National_Museum:_1443
attributed to: KERCH_by_UNKNOWN
type: Object
instanceOf: hydria

Beazley-31359
type: NamedIndividual
type: bell krater
decoration: A:_ATHLETE_JUMPING,_POST,_STRIGIL_SUSPENDED
decoration: B:_NIKE_WITH_FILLET
technique: RED-FIGURE
publication record: Kephalidou,_E.,_Nikitis,_Eikonographiki_meleti_tou_archaiou_ellinikou_athlitismou_(Thessaloniki,_1996):_PL.46_(A,_B)
publication record: Tzachou-Alexandri,_O.,_Mind_and_Body:_Athletic_Contests_in_Ancient_Greece_(Athens,_1988):_169,_NO.54_(A)
date: -425_to_-375
current collection: Athens,_National_Museum:_19392
previous collection: Athens,_Empedokles
type: Object
instanceOf: bell krater
denotedByProperName: Beazley-31359 en

Beazley-218307
type: NamedIndividual
type: calyx krater
technique: RED-FIGURE
type: Object
instanceOf: calyx krater

Beazley-300915
type: NamedIndividual
type: column krater
technique: BLACK-FIGURE
type: Object
instanceOf: column krater

place-38.3466880333,23.1846775333
type: NamedIndividual
type: lieu
note: Boeotia (Latin, 30 BC - AD 300) Βοιωτία (Boiōtía: Ancient Greek, 550 BC - 330 BC) Pleiades URI: https:pleiades.stoa.orgplaces540689
latitude: 38.3467
longitude: 23.1847
type: Object
instanceOf: lieu
denotedByProperName: Boeotia en
denotedByProperName: Βοιωτία el

Beazley-218206
type: NamedIndividual
type: calyx krater
technique: RED-FIGURE
type: Object
instanceOf: calyx krater

Beazley-214878
type: NamedIndividual
type: bell krater
technique: RED-FIGURE
decoration: A:_ATHLETE_WITH_STRIGIL,_DRAPED_MAN_WITH_STAFF_(TRAINER),_POST
decoration: B:_COLUMN_BETWEEN_DRAPED_YOUTHS
publication record: Beazley,_J.D.,_Attic_Red-Figure_Vase-Painters,_2nd_edition_(Oxford,_1963):_1125.17
vase number in beazley: 214878
date: -450_to_-400
current collection: Athens,_National_Museum:_N1144
fabric: Athenian
previous collection: Athens_National_Museum_12239
attributed to: ACADEMY_P_by_BEAZLEY
type: Object
instanceOf: bell krater
denotedByProperName: Beazley-214878 en

Beazley-218135
type: NamedIndividual
type: calyx krater
technique: RED-FIGURE
type: Object
instanceOf: calyx krater

Beazley-218273
type: NamedIndividual
type: calyx krater
technique: RED-FIGURE
type: Object
instanceOf: calyx krater

Beazley-218252
type: NamedIndividual
type: bell krater
technique: RED-FIGURE
type: Object
instanceOf: bell krater

Beazley-218294
type: NamedIndividual
type: calyx krater
technique: RED-FIGURE
type: Object
instanceOf: calyx krater

Beazley-218177
type: NamedIndividual
type: calyx krater
technique: RED-FIGURE
type: Object
instanceOf: calyx krater

Beazley-21308
type: NamedIndividual
type: calyx krater
technique: RED-FIGURE
type: Object
instanceOf: calyx krater

Beazley-45059
type: NamedIndividual
type: calyx krater
technique: RED-FIGURE
type: Object
instanceOf: calyx krater

Beazley-218130
type: NamedIndividual
type: calyx krater
technique: RED-FIGURE
type: Object
instanceOf: calyx krater
denotedByProperName: Beazley-218130 en

Beazley-213662
type: NamedIndividual
type: bell krater
technique: RED-FIGURE
publication record: Beazley,_J.D.,_Attic_Red-Figure_Vase-Painters,_2nd_edition_(Oxford,_1963):_1053.33
vase number in beazley: 213662
current collection: Athens,_National_Museum
fabric: ATHENIAN
type: Object
instanceOf: bell krater

Beazley-218336
type: NamedIndividual
type: bell krater
technique: RED-FIGURE
type: Object
instanceOf: bell krater

Beazley-206939
type: NamedIndividual
type: volute krater
technique: RED-FIGURE
type: Object
instanceOf: volute krater

Beazley-31663
type: NamedIndividual
type: calyx krater
technique: RED-FIGURE
type: Object
instanceOf: calyx krater

Beazley-46072
type: NamedIndividual
type: calyx krater
technique: RED-FIGURE
type: Object
instanceOf: calyx krater
denotedByProperName: Beazley-46072 en

François vase
type: NamedIndividual
type: volute krater
height: 66
date: 570_BCE
type of material: clay
provenance: Attica
type: Object
instanceOf: volute krater
denotedByProperName: François vase en

Beazley-218310
type: NamedIndividual
type: calyx krater
technique: RED-FIGURE
type: Object
instanceOf: calyx krater

Beazley-201929
type: NamedIndividual
type: calyx krater
technique: RED-FIGURE
type: Object
instanceOf: calyx krater

Beazley-16377
type: NamedIndividual
type: calyx krater
technique: RED-FIGURE
decoration: A:_DIONYSOS_AND_ARIADNE_SEATED,_MAENADS,_WITH_THYRSOI,_SATYRS,_ONE_WITH_POINTED_AMPHORA
decoration: B:_POSEIDON,_AMYMONE_SEATED_ON_HYDRIA,_SATYRS_AND_MAENADS
publication record: Brommer,_F.,_Satyrspiele,_2nd_ed._(Berlin,_1959):_20,_FIG.12_(B)
publication record: Curti,_F.,_La_Bottega_del_pittore_di_Meleagro,_RdA_Supplement_25_(Rome,_2001):_PL.19_(A)
publication record: Kaltsas,_N._(ed.),_Athens-Sparta_(New_York,_2006):_278-279,_NO.164_(COLOUR_OF_A_AND_B)
publication record: Kathariou,_K.,_To_ergasterio_tou_zographou_tou_Meleagrou_kai_he_epoche_tou:_paratereseis_sten_attike_keramike_tou_protou_tetartou_tou_4_ou_ai._p.Ch._(Thessaloniki,_2002):_359,_417,_FIG.7A_(DRAWING_OF_PROFILE),_PL.60B-D_(A,B)
publication record: Lexicon_Iconographicum_Mythologiae_Classicae:_III,_PL.387,_DIONYSOS_748_(A)
publication record: Metzger,_H.,_Les_representations_dans_la_ceramique_attique_du_IVe_siecle_(Paris,_1951):_PL.14.2A,_2B_(A,_B)
publication record: Mitteilungen_des_Deutschen_Archaologischen_Instituts,_Athenische_Abteilung:_63-64_(1938-39),_PL.68.2_(B)
publication record: Nicole,_G.,_Catalogue_des_vases_peints_du_musee_national_d'_Athenes,_Suppl._(Paris,_1911):_PL.19
publication record: PHOTOGRAPH(S)_IN_THE_BEAZLEY_ARCHIVE:_12_(A,_B,_PARTS,_INCLUDING_COLOUR)
date: -400_to_-300
current collection: Athens,_National_Museum:_12596
fabric: ATHENIAN
attributed to: MELEAGER_P_by_CURTI
attributed to: MELEAGER_P_by_KATHARIOU
type: Object
instanceOf: calyx krater
denotedByProperName: Beazley-16377 en

Beazley-205795
type: NamedIndividual
type: column krater
technique: RED-FIGURE
type: Object
instanceOf: column krater

Beazley-218184
type: NamedIndividual
type: calyx krater
technique: RED-FIGURE
type: Object
instanceOf: calyx krater

Beazley-305051
type: NamedIndividual
type: column krater
technique: BLACK-FIGURE
type: Object
instanceOf: column krater

Beazley-218046
type: NamedIndividual
type: calyx krater
technique: RED-FIGURE
type: Object
instanceOf: calyx krater
denotedByProperName: Beazley-218046 en

Beazley-218306
type: NamedIndividual
type: calyx krater
technique: RED-FIGURE
type: Object
instanceOf: calyx krater

Beazley-216006
type: NamedIndividual
type: bell krater
technique: RED-FIGURE
type: Object
instanceOf: bell krater

Beazley-5556
type: NamedIndividual
type: calyx krater
technique: RED-FIGURE
type: Object
instanceOf: calyx krater
denotedByProperName: Beazley-5556 en

place-38.0281126064,22.8528202479
type: NamedIndividual
type: lieu
note: Perachora (Heraion) Corinth Greece Pleiades URI: https:pleiades.stoa.orgplaces570288
latitude: 38.0281
longitude: 22.8528
type: Object
instanceOf: lieu
denotedByProperName: Perachora en
denotedByProperName: Heraion Perachora en

Beazley-9029713
type: NamedIndividual
type: bell krater
technique: RED-FIGURE
type: Object
instanceOf: bell krater

Beazley-218298
type: NamedIndividual
type: calyx krater
technique: RED-FIGURE
type: Object
instanceOf: calyx krater

Beazley-275986
type: NamedIndividual
type: column krater
technique: RED-FIGURE
type: Object
instanceOf: column krater

Beazley-8828
type: NamedIndividual
type: column krater
technique: BLACK-FIGURE
type: Object
instanceOf: column krater

Beazley-302317
type: NamedIndividual
type: column krater
technique: BLACK-FIGURE
type: Object
instanceOf: column krater

Beazley-218322
type: NamedIndividual
type: calyx krater
technique: RED-FIGURE
type: Object
instanceOf: calyx krater

Beazley-218205
type: NamedIndividual
type: calyx krater
technique: RED-FIGURE
type: Object
instanceOf: calyx krater

Beazley-30209
type: NamedIndividual
type: bell krater
decoration: A:_DRAPED_YOUTH_IN_CHLAMYS_AND_PETASOS,_WITH_SPEARS,_NIKE_WITH_FILLET,_HERAKLES_SEATED_WITH_CLUB_AND_APPLES_(?),_QUIVER,_FILLET_AND_CLOTH_(?)
technique: RED-FIGURE
publication record: Dumont,_A._&_Chaplain,_J.,_Les_ceramiques_de_la_Grece_propre_(Paris,_1888):_PL.15
publication record: Lexicon_Iconographicum_Mythologiae_Classicae:_V,_177,_HERAKLES_3462_(NOT_ILLUSTRATED)
publication record: Vollkommer,_R.,_Herakles_in_the_Art_of_Classical_Greece_(Oxford,_1988):_49,_NO.349_(NOT_ILLUSTRATED)
date: -450_to_-400
current collection: Athens,_National_Museum:_1384
fabric: ATHENIAN
provenance: BOEOTIA,_DOMBRENA
previous collection: Athens,_National_Museum:_CC1346
previous collection: Athens,_National_Museum:_1234
attributed to: BOEOTIAN_QUERY_by_COLLIGNON
found at: place-38.3466880333,23.1846775333
type: Object
instanceOf: bell krater
denotedByProperName: Beazley-30209 en

Beazley-214877
type: NamedIndividual
type: bell krater
technique: RED-FIGURE
decoration: A:_YOUTHS_AND_MAN
decoration: B:_YOUTHS
publication record: Beazley,_J.D.,_Attic_Red-Figure_Vase-Painters,_2nd_edition_(Oxford,_1963):_1125.16
vase number in beazley: 214877
LIMC ID: 90297
date: 450-400
current collection: 1:_Athens,_National_Museum:_N1143
fabric: ATHENIAN
previous collection: 1:_Athens,_National_Museum:_12238
attributed to: ACADEMY_P_by_BEAZLEY
type: Object
instanceOf: bell krater
denotedByProperName: Beazley-214877 en

Beazley-218293
type: NamedIndividual
type: calyx krater
technique: RED-FIGURE
type: Object
instanceOf: calyx krater

Beazley-215332
type: NamedIndividual
type: bell krater
technique: RED-FIGURE
decoration: A:_SACRIFICE,_DRAPED_MEN,_ONE_WITH_PHIALE_AT_ALTAR,_ONE_LEANING_ON_STAFF,_DRAPED_YOUTH_WITH_SACRIFICIAL_BASKET,_HERM
decoration: B:_DRAPED_YOUTHS
publication record: Beazley,_J.D.,_Attic_Red-Figure_Vase-Painters,_2nd_edition_(Oxford,_1963):_1158
vase number in beazley: 215332
date: -450_to_-400
current collection: Athens,_National_Museum:_CC1348
fabric: ATHENIAN
previous collection: Athens,_National_Museum:_1466
attributed to: Compare_DINOS_P_by_BEAZLEY
type: Object
instanceOf: bell krater
denotedByProperName: Beazley-215332 en

Beazley-218059
type: NamedIndividual
type: calyx krater
technique: RED-FIGURE
type: Object
instanceOf: calyx krater
denotedByProperName: Beazley-218059 en

Beazley-218319
type: NamedIndividual
type: calyx krater
technique: RED-FIGURE
type: Object
instanceOf: calyx krater

Beazley-218289
type: NamedIndividual
type: calyx krater
technique: RED-FIGURE
type: Object
instanceOf: calyx krater

Beazley-260142
type: NamedIndividual
type: bell krater
technique: RED-FIGURE
type: Object
instanceOf: bell krater

Beazley-214637
type: NamedIndividual
type: bell krater
technique: RED-FIGURE
type: Object
instanceOf: bell krater

Beazley-19983
type: NamedIndividual
type: calyx krater
technique: RED-FIGURE
type: Object
instanceOf: calyx krater

Beazley-215424
type: NamedIndividual
type: calyx krater
technique: RED-FIGURE
decoration: A:_DIONYSOS_IN_PATTERNED_COSTUME_AND_CHITONISKOS_AND_SATYR_DANCING_B:_DRAPED_YOUTH_WITH_STAFF,_BAG_SUSPENDED
vase number in beazley: 215424
date: -450_to_-400
current collection: Athens,_National_Museum:_12908
fabric: ATHENIAN
provenance: Beazley,_J.D.,_Attic_Red-Figure_Vase-Painters,_2nd_edition_(Oxford,_1963):_1165.72_Oakley,_J._and_Palagia,_O._(eds.),_Athenian_Potters_and_Painters,_Volume_II_(Oxford,_2010):_95,_FIG.6_(A)
attributed to: MUNICH_2335,_P_OF_by_BEAZLEY
type: Object
instanceOf: calyx krater
denotedByProperName: Beazley-215424 en

Beazley-15412
type: NamedIndividual
type: calyx krater
technique: RED-FIGURE
type: Object
instanceOf: calyx krater

amphora
type: LexicalEntry
lexical form: amphora
evokes: lexical concept amphora en
denotes: amphora
type: Term
termName: amphora
language: en
denotedConcept: amphora
termStatus: preferred
partOfSpeech: preferred
gender: preferred
termDefinition: Vase with neck and two handles for storing and transport liquids and solids.
definition: Vase with neck and two handles for storing and transport liquids and solids.
note: "The amphora (pl. amphorae; from Greek amphi - on both sides, phero - carry) is a two-handled pot with a neck that is considerably narrower than the body. It was used for the storage of liquids and solids such as grain. Undecorated 'coarse' amphorae, with their lower part tapering to a point, were the standard transport containers in the Mediterranean. They are frequently depicted in symposium scenes. Panathenaic prize amphorae are perhaps the closest in shape, but the majority of painted amphorae are grouped into two main types, the one-piece belly-amphorae, and neck-amphorae, which have a clearly-marked neck. Also discussed here is the pelike, another two-handled storage vessel." http:www.beazley.ox.ac.uktoolspotteryshapesamphorae.htm 2020-05-03
note: ἀμφορ-εύς , έως, ὁ: acc. A.“ἀμφορέα” Ar.Fr.299: dual “ἀμφορῆ” Telecl.2 D.: pl. “ἀμφορῆς” Ar.Nu.1203:—jar with narrow neck (“στενόστομον τὸ τεῦχος” Id.Fr. 108), Hdt.4.163, Ar.Nu.1203, etc.; used for various purposes, esp. for keeping wine in, Pl.807, Fr.299; or milk, E.Cyc.327; for pickles, X. An.5.4.28. 2. ornament in shape of vase, “ὅρμος -έων” IG11(2).161B 38 (Delos, iii B.C.), cf. SIG2588.199 (ib., ii B.C.). II. liquid measure, = μετρητής (Philyll.7, Moer.45, etc.), 1 12 Roman amphorae or nearly 9 gallons, Hdt.1.51, IG3.38, D.43.8, etc. (Shortened form of ἀμφιφορεύς, q.v., from having two handles.） http:www.perseus.tufts.eduhoppertext?doc=Perseus:text:1999.04.0057:entry=a)mforeus 2020 05 08
note: "A two-handled vase with a narrow neck used for storage or transport. This vessel shape is common in both plain and decorated wares. Transport amphorae are large undecorated vessels, often with pointed bases. Attic decorated wares favor the amphora shape and many subdivisions of the type have been identified. Term: The word is Greek, and is apparently the ancient name for this vessel." http:www.perseus.tufts.eduhoppertext?doc=Perseus:text:1999.04.0004:id=amphora
context: ὁ δὲ Ἀρκεσίλεως τοῦτον τὸν χρόνον ἐὼν ἐν Σάμῳ συνήγειρε πάντα ἄνδρα ἐπὶ γῆς ἀναδασμῷ: συλλεγομένου δὲ στρατοῦ πολλοῦ, ἐστάλη ἐς Δελφοὺς Ἀρκεσίλεως χρησόμενος τῷ χρηστηρίῳ περὶ κατόδου. [2] ἡ δὲ Πυθίη οἱ χρᾷ τάδε. “‘ἐπὶ μὲν τέσσερας Βᾶττους καὶ Ἀρκεσίλεως τέσσερας, ὀκτὼ ἀνδρῶν γενεάς, διδοῖ ὑμῖν Λοξίης βασιλεύειν Κυρήνης, [3] πλέον μέντοι τούτου οὐδὲ πειρᾶσθαι παραινέει. σὺ μέντοι ἥσυχος εἶναι κατελθὼν ἐς τὴν σεωυτοῦ. ἢν δὲ τὴν κάμινον εὕρῃς πλέην ἀμφορέων, μὴ ἐξοπτήσῃς τοὺς ἀμφορέας ἀλλ᾽ ἀπόπεμπε κατ᾽ οὖρον: εἰ δὲ ἐξοπτήσεις τὴν κάμινον,1μὴ ἐσέλθῃς ἐς τὴν ἀμφίρρυτον: εἰ δὲ μὴ ἀποθανέαι καὶ αὐτὸς καὶ ταῦρος ὁ καλλιστεύων.’” ταῦτα ἡ Πυθίη Ἀρκεσίλεῳ χρᾷ. Hdt. 4.163 http:www.perseus.tufts.eduhoppertext?doc=Perseus:abo:tlg,0016,001:4:163&lang=original 2020 05 08
context: ""The amphorae are full of red and fragrant wine." Aristoph. Pl. 807 http:www.perseus.tufts.eduhoppertext?doc=Aristoph.%20Pl.%20807&lang=original
context: "drinking a whole amphora of milk." Eur. Cycl. 327 http:www.perseus.tufts.eduhoppertext?doc=Eur.%20Cycl.%20327&lang=original
context: "They found pickled slices of dolphin in amphorae." Xen. Anab. 5.4.28 http:www.perseus.tufts.eduhoppertext?doc=Xen.%20Anab.%205.4.28&lang=original

amphora
type: Form

lexical concept amphora en
type: LexicalConcept
is evoked by: amphora
definition: Vase with neck and two handles for storing and transport liquids and solids.

neck amphora
type: LexicalEntry
lexical form: neck amphora
evokes: lexical concept neck amphora en
denotes: neck amphora
type: Term
termName: neck amphora
language: en
denotedConcept: neck amphora
termStatus: preferred
partOfSpeech: preferred
gender: preferred
termDefinition: Amphora with foot, with a clearly defined neck.
definition: Amphora with foot, with a clearly defined neck.
note: "The neck-amphora is identifiable by its clearly defined neck." https:www.beazley.ox.ac.uktoolspotteryshapesneck.htm

neck amphora
type: Form

lexical concept neck amphora en
type: LexicalConcept
is evoked by: neck amphora
definition: Amphora with foot, with a clearly defined neck.

vase
type: LexicalEntry
lexical form: vase
evokes: lexical concept vase en
denotes: vase
type: Term
termName: vase
language: en
denotedConcept: vase
termStatus: preferred
partOfSpeech: preferred
gender: preferred
termDefinition: Ceramic vessel.
definition: Ceramic vessel.

vase
type: Form

lexical concept vase en
type: LexicalConcept
is evoked by: vase
definition: Ceramic vessel.

panathenaic prize amphora
type: LexicalEntry
lexical form: panathenaic prize amphora
evokes: lexical concept panathenaic prize amphora en
denotes: panathenaic prize amphora
type: Term
termName: panathenaic prize amphora
language: en
denotedConcept: panathenaic prize amphora
termStatus: preferred
partOfSpeech: preferred
gender: preferred
termDefinition: Vase with foot, two handles, and neck, which served as prize in the Panathenaic games. Its names comes from its shape (like an amphora) and in connection to the Panathenaic festival.
definition: Vase with foot, two handles, and neck, which served as prize in the Panathenaic games. Its names comes from its shape (like an amphora) and in connection to the Panathenaic festival.
note: "The broad body, narrow neck and foot of Panathenaic amphorae gives a shape reminiscent of transport amphorae. They served as prizes in the Panathenaic Games, containing oil for victors." https:www.beazley.ox.ac.uktoolspotteryshapespanathenaic.htm

panathenaic prize amphora
type: Form

lexical concept panathenaic prize amphora en
type: LexicalConcept
is evoked by: panathenaic prize amphora
definition: Vase with foot, two handles, and neck, which served as prize in the Panathenaic games. Its names comes from its shape (like an amphora) and in connection to the Panathenaic festival.

column krater
type: LexicalEntry
lexical form: column krater
evokes: lexical concept column krater en
denotes: column krater
type: Term
termName: column krater
language: en
denotedConcept: column krater
termStatus: preferred
partOfSpeech: preferred
gender: preferred
termDefinition: Krater with a clearly defined neck and column-like handles.
definition: Krater with a clearly defined neck and column-like handles.
note: "Named for its column-like handles, the column-krater is first known from Corinthian examples dated to the late seventh century. It is regularly produced by Athenian potters from the first half of the sixth-century until the third quarter of the fifth. It seems from graffiti on Athenian red-figure examples that the vessel was referred to as Korinthios or Korinthiourges." Classical Art Research Centre, University of Oxford. Accessible online: https:www.beazley.ox.ac.uktoolspotteryshapescolumn.htm 2020 05 08

column krater
type: Form

lexical concept column krater en
type: LexicalConcept
is evoked by: column krater
definition: Krater with a clearly defined neck and column-like handles.

type B amphora
type: LexicalEntry
lexical form: type B amphora
evokes: lexical concept type B amphora en
denotes: type B amphora
type: Term
termName: type B amphora
language: en
denotedConcept: type B amphora
termStatus: preferred
partOfSpeech: preferred
gender: preferred
termDefinition: Belly amphora with round handles and straight lip.
definition: Belly amphora with round handles and straight lip.
note: "The most typically occurring form is termed Type B, characterised by the combination of round handles, the mouth's straight lip, and the convex profile of the one-piece foot (termed 'echinus'). The shape is old, dating back to the seventh century, and continuing to be produced until the mid-fifth century." https:www.beazley.ox.ac.uktoolspotteryshapesbelly.htm
note: "A variation of the neck-less amphora, characterized by a continuous curve from lip to foot. Shape: It is characterized by a straight or slightly concave lip, an inverted echinus foot, and plain cylindrical looped handles, which reach from the sloping shoulder to the middle of the neck. History: A variation of the one-piece amphora, Type B was introduced by 610 B.C. , and is the earliest in the sequence with this series of amphorae which form a continuous curve from the lip to the foot. The decoration was confined to the two panels, one on the front and one on the reverse of the vase. Above these panels appears a floral chain. Above the foot is a reserved frieze which contains a band of rays. It lasts to the third quarter of the fifth century B.C." http:www.perseus.tufts.eduhoppertext?doc=Perseus:text:1999.04.0004:id=type-b-amphora

type B amphora
type: Form

lexical concept type B amphora en
type: LexicalConcept
is evoked by: type B amphora
definition: Belly amphora with round handles and straight lip.

bell krater
type: LexicalEntry
lexical form: bell krater
evokes: lexical concept bell krater en
denotes: bell krater
type: Term
termName: bell krater
language: en
denotedConcept: bell krater
termStatus: preferred
partOfSpeech: preferred
gender: preferred
termDefinition: Krater without neck, with upward curling handles placed high on the body.
definition: Krater without neck, with upward curling handles placed high on the body.
note: "The latest of the four krater-types, it first occurs in the early fifth century, and is not found decorated in black-figure. It is named for its bell-like shape, perhaps originating in wood. It has small horizontal upturned handles just over halfway up the body. Some do not have a foot, and earlier examples may have lugs for handles. Over the course of the fifth and fourth centuries, the shape becomes slimmer." Classical Art Research Centre, University of Oxford. Accessible online: https:www.beazley.ox.ac.uktoolspotteryshapesbell.htm (2020 05 08)
context: The bell krater is a vessel new to the red-figure style, and is established in the repertory of the potters by about 500 B.C. It continues through the early fourth century B.C. http:www.perseus.tufts.eduhoppertext?doc=Perseus%3Atext%3A1999.04.0004%3Aalphabetic+letter%3DB%3Aentry+group%3D2%3Aentry%3Dbell-krater

bell krater
type: Form

lexical concept bell krater en
type: LexicalConcept
is evoked by: bell krater
definition: Krater without neck, with upward curling handles placed high on the body.

hydria
type: LexicalEntry
lexical form: hydria
evokes: lexical concept hydria en
denotes: hydria
type: Term
termName: hydria
language: en
denotedConcept: hydria
termStatus: preferred
partOfSpeech: preferred
gender: preferred
termDefinition: Vase with neck and three handles, two for carrying and one for pouring, for storing and transport water.
definition: Vase with neck and three handles, two for carrying and one for pouring, for storing and transport water.
note: An old shape, with precursors in the eighth century, the hydria (pl. hydriai; compare Greek hudor - water) is a water-jar with three handles, two for carrying and one for pouring. The application of the name to the shape is reasonably certain, although such vessels were not only used for the carrying of water. We know, for example, that hydriai held votes in ballots and ashes in cemeteries. http:www.beazley.ox.ac.uktoolspotteryshapeshydria.htm 2020 05 08
note: ὑδρ-ία , ἡ, (ὕδωρ) A.water-pot, pitcher, Ar.V.926, Ec.678 (anap.), LXX Ec.12.6, CIG2855.10 (Branchidae), Ev.Jo.2.6, etc.; ὑδρίης πέρι δῆρις (cf. ἀμφορίτης) A.R.4.1767: prov., ἐπὶ θύραις τὴν ὑδρίαν to break the pitcher at the door, 'there's many a slip 'twixt cup and lip', Arist.Rh.1363a7. II. vessel of any kind, e. g. wine-pot, Ar.Fr. 136; a pot of money, Id.Av.602 (anap.) (ἐν ὑδρίαις γὰρ ἔκειντο οἱ θησαυροί Sch. ad loc.(603)), cf. IG11(2).161 B100 (Delos, iii B. C.); “ὑ. χαλκῆ” D.47.52; ὑ. χρυσῆ, ἀργυρᾶ, IG22.204.35; ὑδρίαι ἄρτων πέντε bread-pans, POxy.155.4 (vi A. D.). 2. balloting urn, esp. in lawcourts, etc., IG9(1).334.45 (Locr., v B. C.), Isoc.17.33, Plu.TG11. 3. cinerary urn, Id.Phil.21, Luc.Dem.Enc.29, etc. 4. water-clock, S.E.M.5.75, Jul.Caes.325c. [ι_ in A.R. l.c., where ὑδρείης is v.l.] http:www.perseus.tufts.eduhoppertext?doc=Perseus%3Atext%3A1999.04.0057%3Aentry%3Du(dri%2Fa (2020 05 08)
context: [6] ἦσαν δὲ ἐκεῖ λίθιναι ὑδρίαι ἓξ κατὰ τὸν καθαρισμὸν τῶν Ἰουδαίων κείμεναι, χωροῦσαι ἀνὰ μετρητὰς δύο ἢ τρεῖς. John 2.6 http:www.perseus.tufts.eduhoppertext?doc=Perseus%3Atext%3A1999.01.0155%3Abook%3DJohn%3Achapter%3D2%3Averse%3D6 (2020 05 08)
context: Πραξάγορα τοὺς κρατῆρας καταθήσω καὶ τὰς ὑδρίας, καὶ ῥαψῳδεῖν ἔσται τοῖς παιδαρίοισιν τοὺς ἀνδρείους ἐν τῷ πολέμῳ, κεἴ τις δειλὸς γεγένηται, 680ἵνα μὴ δειπνῶσ᾽ αἰσχυνόμενοι. Aristoph. Eccl. 678 http:www.perseus.tufts.eduhoppertext?doc=Perseus:abo:tlg,0019,010:678&lang=original 2020 05 08

hydria
type: Form

lexical concept hydria en
type: LexicalConcept
is evoked by: hydria
definition: Vase with neck and three handles, two for carrying and one for pouring, for storing and transport water.

panathenaic amphora
type: LexicalEntry
lexical form: panathenaic amphora
evokes: lexical concept panathenaic amphora en
denotes: panathenaic prize amphora
type: Term
termName: panathenaic amphora
language: en
denotedConcept: panathenaic prize amphora
termStatus: alternative
partOfSpeech: alternative
gender: alternative
termDefinition: Vase with foot, two handles, and neck, which served as prize in the Panathenaic games. Its names comes from its shape (like an amphora) and in connection to the Panathenaic festival.
definition: Vase with foot, two handles, and neck, which served as prize in the Panathenaic games. Its names comes from its shape (like an amphora) and in connection to the Panathenaic festival.

panathenaic amphora
type: Form

lexical concept panathenaic amphora en
type: LexicalConcept
is evoked by: panathenaic amphora
definition: Vase with foot, two handles, and neck, which served as prize in the Panathenaic games. Its names comes from its shape (like an amphora) and in connection to the Panathenaic festival.

lekythos
type: LexicalEntry
lexical form: lekythos
evokes: lexical concept lekythos en
denotes: lekythos
type: Term
termName: lekythos
language: en
denotedConcept: lekythos
termStatus: preferred
partOfSpeech: preferred
gender: preferred
termDefinition: Vase for perfume for oil, with narrow neck, with one handle.
definition: Vase for perfume for oil, with narrow neck, with one handle.
note: Like the aryballos, in that it has a narrow neck and a single handle, the lekythos (pl. lekythoi) is generally a taller vessel with a small, deep mouth. The Greek word lekythos was undoubtedly used for the various forms considered here, although it does appear that it was used for oil-vessels in general. http:www.beazley.ox.ac.uktoolspotteryshapeslekythos.htm 2020 05 08
note: λήκυ^θος (Dor. λάκυθος [α_] IG42(1).123.130 (Epid., iv B.C.)), ἡ, A.oil-flask, “δῶκεν δὲ χρυσέῃ ἐν ληκύθῳ ὑγρὸν ἔλαιον” Od.6.79, cf. 215, Hp. Morb.4.51, Ph.Bel.102.41, etc.; casket for unguents, cosmetics, etc., S.Fr.130; “αἱ δὲ λήκυθοι μύρου γέμουσι” Ar.Pl.810, cf. Fr.207; buried or burnt with the dead, Id.Ec.538, 996, 1032, cf. IG14.865, CIG 8346k. 2. in pl., rhetorical bombast, Cic.Att.1.14.3, Plin.Ep.1.2.4. II. projecting cartilage on the gullet, Adam's apple, = βρόχθος, Clearch.72. http:www.perseus.tufts.eduhoppertext?doc=Perseus%3Atext%3A1999.04.0057%3Aentry%3Dlh%2Fkuqos 2020 05 08
context: λήκυ^θος (Dor. λάκυθος [α_] IG42(1).123.130 (Epid., iv B.C.)), ἡ, A.oil-flask, “δῶκεν δὲ χρυσέῃ ἐν ληκύθῳ ὑγρὸν ἔλαιον” Od.6.79, cf. 215, Hp. Morb.4.51, Ph.Bel.102.41, etc.; casket for unguents, cosmetics, etc., S.Fr.130; “αἱ δὲ λήκυθοι μύρου γέμουσι” Ar.Pl.810, cf. Fr.207; buried or burnt with the dead, Id.Ec.538, 996, 1032, cf. IG14.865, CIG 8346k. 2. in pl., rhetorical bombast, Cic.Att.1.14.3, Plin.Ep.1.2.4. II. projecting cartilage on the gullet, Adam's apple, = βρόχθος, Clearch.72.

lekythos
type: Form

lexical concept lekythos en
type: LexicalConcept
is evoked by: lekythos
definition: Vase for perfume for oil, with narrow neck, with one handle.

volute krater
type: LexicalEntry
lexical form: volute krater
evokes: lexical concept volute krater en
denotes: volute krater
type: Term
termName: volute krater
language: en
denotedConcept: volute krater
termStatus: preferred
partOfSpeech: preferred
gender: preferred
termDefinition: Krater with a clearly defined neck and volute-like handles.
definition: Krater with a clearly defined neck and volute-like handles.
note: "The volute-krater is named after its handles. The François Vase is a famous and early example, but the typical Athenian form occurs only later in the sixth century, with the handles tightly curled so that they look like the volutes on Ionic columns. The shape is also found in metal. Over the course of the fifth and fourth centuries, examples become slimmer, and Apulian volute-kraters from South Italy are particularly elaborate." Classical Art Research Centre, University of Oxford. Accessible online: https:www.beazley.ox.ac.uktoolspotteryshapesvolute.htm 2020 05 08

volute krater
type: Form

lexical concept volute krater en
type: LexicalConcept
is evoked by: volute krater
definition: Krater with a clearly defined neck and volute-like handles.

belly amphora
type: LexicalEntry
lexical form: belly amphora
evokes: lexical concept belly amphora en
denotes: belly amphora
type: Term
termName: belly amphora
language: en
denotedConcept: belly amphora
termStatus: preferred
partOfSpeech: preferred
gender: preferred
termDefinition: Amphora with foot, without a clearly defined neck.
definition: Amphora with foot, without a clearly defined neck.
note: "The belly-amphora has a continuous profile from lip to foot. It is usually lidded." https:www.beazley.ox.ac.uktoolspotteryshapesbelly.htm

belly amphora
type: Form

lexical concept belly amphora en
type: LexicalConcept
is evoked by: belly amphora
definition: Amphora with foot, without a clearly defined neck.

pelike
type: LexicalEntry
lexical form: pelike
evokes: lexical concept pelike en
denotes: pelike
type: Term
termName: pelike
language: en
denotedConcept: pelike
termStatus: preferred
partOfSpeech: preferred
gender: preferred
termDefinition: Amphora with foot and a sagging belly.
definition: Amphora with foot and a sagging belly.
note: "A variation of the one-piece amphora, so called because the neck flows smoothly into the body, in contrast to the offset neck of a neck amphora. History: The shape first appears in Attic red-figure after 520 B.C. and remains popular through the fourth century B.C. The shape is taken over by the potters of Gnathia, where it becomes slimmer and more fanciful. The widest portion of the pelike is towards its base. Term: The Greek word "pelike" was not applied to this shape in ancient times but was adopted by modern archaeologists; the ancient "pelike" is described variously as a kylix, a chous (or small oinochoe), and a lekanis." http:www.perseus.tufts.eduhoppertext?doc=Perseus:text:1999.04.0004:id=pelike

pelike
type: Form

lexical concept pelike en
type: LexicalConcept
is evoked by: pelike
definition: Amphora with foot and a sagging belly.

type C amphora
type: LexicalEntry
lexical form: type C amphora
evokes: lexical concept type C amphora en
denotes: type C amphora
type: Term
termName: type C amphora
language: en
denotedConcept: type C amphora
termStatus: preferred
partOfSpeech: preferred
gender: preferred
termDefinition: Belly amphora with round handles and round lip.
definition: Belly amphora with round handles and round lip.
note: "A variation of the neck-less amphora, characterized by a continuous curve from lip to foot. Shape: The shape is similar to Type B , but with a convex (rolled) lip, and either a torus or an inverted echinus foot. History: This form is especially popular in the third quarter of the sixth century with the black-figure painter known as the Affecter, who also paints neck amphorae. The shape continues in red-figure pottery from about 520 to 450 B.C. In black-figure the decoration is confined to the two panels which appear on the front and the reverse of the vessel. Sometimes the zone above the foot-disc is reserved and contains a band of upright rays. In red-figure, the panel is abandoned in favour of a figure placed in silhouette against the black ground of the body of the vessel." http:www.perseus.tufts.eduhoppertext?doc=Perseus:text:1999.04.0004:id=type-c-amphora

type C amphora
type: Form

lexical concept type C amphora en
type: LexicalConcept
is evoked by: type C amphora
definition: Belly amphora with round handles and round lip.

calyx krater
type: LexicalEntry
lexical form: calyx krater
evokes: lexical concept calyx krater en
denotes: calyx krater
type: Term
termName: calyx krater
language: en
denotedConcept: calyx krater
termStatus: preferred
partOfSpeech: preferred
gender: preferred
termDefinition: Krater without neck, with upward curling handles placed low on the body.
definition: Krater without neck, with upward curling handles placed low on the body.
note: "The handles of the calyx-krater are placed low down on the body, at what is termed the cul. Their upward curling form lends the shape an appearance reminiscent of the calyx of a flower, hence the name. The earliest known example was possibly made by Exekias in the third quarter of the sixth century. It continues to be produced, mainly in red-figure, becoming more elongated over the course of the fifth and fourth centuries." Classical Art Research Centre, University of Oxford. Accessible online: https:www.beazley.ox.ac.uktoolspotteryshapescalyx.htm 2020 05 08
note: "The calyx-krater is one of the largest Attic vases, and is reminiscent of a bell-shaped flower. It is named for its convex lower body that has the configuration of the calyx of a flower, while the flaring upper body is suggestive of the bell-shaped corolla. It has large, robust, upturned handles situated opposite one another on the cul.The calyx-krater appears in Attic black-figure after the middle of the 6th c. BCE and is a popular shape until the end of red-figure." http:kerameikos.orgidcalyx_krater

calyx krater
type: Form

lexical concept calyx krater en
type: LexicalConcept
is evoked by: calyx krater
definition: Krater without neck, with upward curling handles placed low on the body.

type A amphora
type: LexicalEntry
lexical form: type A amphora
evokes: lexical concept type A amphora en
denotes: type A amphora
type: Term
termName: type A amphora
language: en
denotedConcept: type A amphora
termStatus: preferred
partOfSpeech: preferred
gender: preferred
termDefinition: Belly amphora with flat handles and straight lip.
definition: Belly amphora with flat handles and straight lip.
note: "During the third quarter of the sixth century, a new, more elaborate type is introduced. Type A amphorae are recognisable by their flat, flanged handles, often decorated with ivy, and two-part ('stepped') foot." https:www.beazley.ox.ac.uktoolspotteryshapesbelly.htm
note: "History: The large neck amphora of the late seventh century is derived from the Protoattic shape and continues to be a popular shape, though in a much smaller version, in both black and red figure pottery. The earliest examples of the type A amphora vary as to the shape of the foot and the mouth, always undergoing remodelling and refinement. The usual form in the first half of the sixth century has a small egg-shaped body, tapering at the foot. There are simple cylindrical handles looped from the shoulder to the mid-neck. Soon after the mid-century, the common form has triple-reeded handles , and the body's center of gravity is a bit higher. But once the shape was evolved and became standardized, the lip was echinus-shaped and the foot torus. It enjoyed great popularity during the late period of black figure, lasting from the second quarter of the sixth century down to about 440 B.C. A more elaborate version of the older neck-less amphora, Type B, is the Type A. This shape appears about 550 B.C. and lasts to about 450 B.C. It is thought that the potter Exekias was responsible for the development of this shape (he worked on both neck-less and neck amphorae). The lip is distinctly concave, and the neck and the shoulder are slightly longer. The belly is less tense than that of the Type B amphora. The strap handles have flanges and decorated edges (usually an ivy tendril). The foot is in two degrees, the lower with a convex profile and the upper with a vertical edge. There is a fillet between the foot and the base of the body. The decoration consists of two panels, one on the front, and one on the reverse, of the vases. They are set a bit lower on the body than on the Type B amphora. Sometimes a palmette appears in a reserved zone below each handle." http:www.perseus.tufts.eduhoppertext?doc=Perseus:text:1999.04.0004:id=type-a-amphora

type A amphora
type: Form

lexical concept type A amphora en
type: LexicalConcept
is evoked by: type A amphora
definition: Belly amphora with flat handles and straight lip.

krater
type: LexicalEntry
lexical form: krater
evokes: lexical concept krater en
denotes: krater
type: Term
termName: krater
language: en
denotedConcept: krater
termStatus: preferred
partOfSpeech: preferred
gender: preferred
termDefinition: Large open container with a foot and handles, used in ancient Greece for mixing wine with water.
definition: Large open container with a foot and handles, used in ancient Greece for mixing wine with water.
note: LSJ (Perseus): mixing vessel, esp. bowl, in which wine was mixed with water. Accessible online: http:www.perseus.tufts.eduhoppertext?doc=Perseus%3Atext%3A1999.04.0057%3Aentry%3Dkrath%2Fr
note: The term 'krater' suggests a mixing-vessel (compare Greek kerannumi - to mix), and we know that the wine served at the symposium was mixed with water. On vases decorated with symposium-scenes, a large open container with a foot is often depicted, and the name krater is appropriate. Examples can be traced back to the large Geometric examples that were used as grave-markers, and this funerary connection continues to be important. Excavations of burial-sites have shown that they could be used in Greek settlements overseas as containers of ashes, and South Italian, especially Apulian, volute-kraters often carry explicit funerary iconography. In the Athenian repertoire, there are four main types identified today: column-, volute-, calyx- and bell-. The psykter is a short-lived shape, used to cool the liquid. It is discussed here because it is often shown being used in kraters. http:www.beazley.ox.ac.uktoolspotteryshapeskraters.htm (2020 05 08)
context: Hom. Il. 23.741 Πηλεΐδης δ᾽ αἶψ᾽ ἄλλα τίθει ταχυτῆτος ἄεθλα ἀργύρεον κρητῆρα τετυγμένον: ἓξ δ᾽ ἄρα μέτρα χάνδανεν, αὐτὰρ κάλλει ἐνίκα πᾶσαν ἐπ᾽ αἶαν πολλόν, ἐπεὶ Σιδόνες πολυδαίδαλοι εὖ ἤσκησαν, Φοίνικες δ᾽ ἄγον ἄνδρες ἐπ᾽ ἠεροειδέα πόντον, 745 στῆσαν δ᾽ ἐν λιμένεσσι, Θόαντι δὲ δῶρον ἔδωκαν Accessible online: http:www.perseus.tufts.eduhoppertext?doc=Perseus:abo:tlg,0012,001:23:741&lang=original
context: κρα-τήρ , Ion.and Ep. κρητήρ , ῆρος, ὁ, (κεράννυμι) A.mixing vessel, esp. bowl, in which wine was mixed with water, κ. ἀργύρεος, χρύσεος, Il.23.741,219; [“κ.] ἀργύρεος ἔστιν ἅπας, χρυσῷ δ᾽ ἐπὶ χείλεα κεκράανται” Od.4.615; “οἶνον δ᾽ ἐκ κρητῆρος ἀφυσσόμενοι δεπάεσσιν ἔκχεον” Il.3.295, cf. 247; κρητῆρι δὲ οἶνον μίσγον ib.269; “κρητῆρα κερασσάμενος” Od.7.179, 13.50; “οἶνον ἔμισγον ἐνὶ κρητῆρσι καὶ ὕδωρ” 1.110, cf.Sapph.51, Alc. 45, S.OC159 (lyr.), Ar.Ec.841; κρατῆρα κεράσαι Orac. ap. D.21.53, cf. Th.6.32; “κρητῆρα καὶ ὑποκρητήριον” SIG2 (Sigeum, vi B.C.); πίνοντες κρητῆρας drinking bowls of wine, Il.8.232; κρητῆρα στήσασθαι ἐλεύθερον to set up a bowl of wine to be drunk in honour of the deliverance 6.528, cf. Od.2.431; κρητῆρα ἐπιστέψασθαι ποτοῖο, v. ἐπιστέφω; κρατῆρος μέρος μετασχεῖν A.Ch.291; “σπονδὴ τρίτου κρατῆρος” S.Fr. 425. Henry George Liddell, Robert Scott, A Greek-English Lexicon http:www.perseus.tufts.edu 2020 05 08

krater
type: Form

lexical concept krater en
type: LexicalConcept
is evoked by: krater
definition: Large open container with a foot and handles, used in ancient Greece for mixing wine with water.

lécythe
type: LexicalEntry
lexical form: lécythe
evokes: lexical concept lécythe fr
denotes: lekythos
type: Term
termName: lécythe
language: fr
denotedConcept: lekythos
termStatus: preferred
partOfSpeech: preferred
gender: preferred
note: Un lécythe (du grec ancien λήκυθος lếkuthos) est un vase grec antique utilisé pour stocker de l'huile parfumée destinée aux soins du corps. La forme est inventée dans la première moitié du VIe siècle av. J.-C.. Un type particulier, le lécythe à fond blanc, est très fréquemment utilisé comme vase funéraire. https:fr.wikipedia.orgwikiL%C3%A9cythe 30042020 @fr

lécythe
type: Form

lieu
type: LexicalEntry
lexical form: lieu
evokes: lexical concept lieu fr
denotes: lieu
type: Term
termName: lieu
language: fr
denotedConcept: lieu
termStatus: preferred
partOfSpeech: preferred
gender: preferred

lieu
type: Form

cratère à volutes
type: LexicalEntry
lexical form: cratère à volutes
evokes: lexical concept cratère à volutes fr
denotes: volute krater
type: Term
termName: cratère à volutes
language: fr
denotedConcept: volute krater
termStatus: preferred
partOfSpeech: preferred
gender: preferred
termDefinition: Cratère avec cou, avec des anses en forme de volutes.
definition: Cratère avec cou, avec des anses en forme de volutes. @fr

cratère à volutes
type: Form

lexical concept cratère à volutes fr
type: LexicalConcept
is evoked by: cratère à volutes
definition: Cratère avec cou, avec des anses en forme de volutes. @fr

hydrie
type: LexicalEntry
lexical form: hydrie
evokes: lexical concept hydrie fr
denotes: hydria
type: Term
termName: hydrie
language: fr
denotedConcept: hydria
termStatus: preferred
partOfSpeech: preferred
gender: preferred

hydrie
type: Form

amphore
type: LexicalEntry
lexical form: amphore
evokes: lexical concept amphore fr
denotes: amphora
type: Term
termName: amphore
language: fr
denotedConcept: amphora
termStatus: preferred
partOfSpeech: preferred
gender: preferred

amphore
type: Form

cratère en calice
type: LexicalEntry
lexical form: cratère en calice
evokes: lexical concept cratère en calice fr
denotes: calyx krater
type: Term
termName: cratère en calice
language: fr
denotedConcept: calyx krater
termStatus: preferred
partOfSpeech: preferred
gender: preferred

cratère en calice
type: Form

cratère
type: LexicalEntry
lexical form: cratère
evokes: lexical concept cratère fr
denotes: krater
type: Term
termName: cratère
language: fr
denotedConcept: krater
termStatus: preferred
partOfSpeech: preferred
gender: preferred
termDefinition: Vase pour mélanger le vin avec de l'eau.
definition: Vase pour mélanger le vin avec de l'eau. @fr

cratère
type: Form

lexical concept cratère fr
type: LexicalConcept
is evoked by: cratère
definition: Vase pour mélanger le vin avec de l'eau. @fr

cratère en cloche
type: LexicalEntry
lexical form: cratère en cloche
evokes: lexical concept cratère en cloche fr
denotes: bell krater
type: Term
termName: cratère en cloche
language: fr
denotedConcept: bell krater
termStatus: preferred
partOfSpeech: preferred
gender: preferred

cratère en cloche
type: Form

cratère à colonnettes
type: LexicalEntry
lexical form: cratère à colonnettes
evokes: lexical concept cratère à colonnettes fr
denotes: column krater
type: Term
termName: cratère à colonnettes
language: fr
denotedConcept: column krater
termStatus: preferred
partOfSpeech: preferred
gender: preferred
termDefinition: Cratère avec cou, avec des anses en forme de colonne.
definition: Cratère avec cou, avec des anses en forme de colonne. @fr

cratère à colonnettes
type: Form

lexical concept cratère à colonnettes fr
type: LexicalConcept
is evoked by: cratère à colonnettes
definition: Cratère avec cou, avec des anses en forme de colonne. @fr

personne
type: LexicalEntry
lexical form: personne
evokes: lexical concept personne fr
denotes: personne
type: Term
termName: personne
language: fr
denotedConcept: personne
termStatus: preferred
partOfSpeech: preferred
gender: preferred

personne
type: Form

vase
type: LexicalEntry
lexical form: vase
evokes: lexical concept vase fr
denotes: vase
type: Term
termName: vase
language: fr
denotedConcept: vase
termStatus: preferred
partOfSpeech: preferred
gender: preferred
termDefinition: Récipient, de matière, de grandeur et de forme variables.
definition: Récipient, de matière, de grandeur et de forme variables. @fr
note: 1. Récipient de grandeur et de forme variables servant à différents usages ou ayant valeur historique, artistique. TLFi 20190113 @fr

vase
type: Form

lexical concept vase fr
type: LexicalConcept
is evoked by: vase
definition: Récipient, de matière, de grandeur et de forme variables. @fr

αμφορέας τύπου Α
type: LexicalEntry
lexical form: αμφορέας τύπου Α
evokes: lexical concept αμφορέας τύπου Α el
denotes: type A amphora
type: Term
termName: αμφορέας τύπου Α
language: el
denotedConcept: type A amphora
termStatus: preferred
partOfSpeech: preferred
gender: preferred
termDefinition: Αμφορέας με επίπεδες λαβές και κοιλιά με ίσιο στόμιο .
definition: Αμφορέας με επίπεδες λαβές και κοιλιά με ίσιο στόμιο . @el

αμφορέας τύπου Α
type: Form

lexical concept αμφορέας τύπου Α el
type: LexicalConcept
is evoked by: αμφορέας τύπου Α
definition: Αμφορέας με επίπεδες λαβές και κοιλιά με ίσιο στόμιο . @el

κρατήρας κιονωτός
type: LexicalEntry
lexical form: κρατήρας κιονωτός
evokes: lexical concept κρατήρας κιονωτός el
denotes: column krater
type: Term
termName: κρατήρας κιονωτός
language: el
denotedConcept: column krater
termStatus: preferred
partOfSpeech: preferred
gender: preferred
termDefinition: Κρατήρας με κιονωτές λαβές και ευδιάκριτο λαιμό.
definition: Κρατήρας με κιονωτές λαβές και ευδιάκριτο λαιμό. @el

κρατήρας κιονωτός
type: Form

lexical concept κρατήρας κιονωτός el
type: LexicalConcept
is evoked by: κρατήρας κιονωτός
definition: Κρατήρας με κιονωτές λαβές και ευδιάκριτο λαιμό. @el

παναθηναϊκός αμφορέας
type: LexicalEntry
lexical form: παναθηναϊκός αμφορέας
evokes: lexical concept παναθηναϊκός αμφορέας el
denotes: panathenaic prize amphora
type: Term
termName: παναθηναϊκός αμφορέας
language: el
denotedConcept: panathenaic prize amphora
termStatus: preferred
partOfSpeech: preferred
gender: preferred
termDefinition: Αμφορέας που δίνεται ως έπαθλο σε νικητές των Παναθηναίων.
definition: Αμφορέας που δίνεται ως έπαθλο σε νικητές των Παναθηναίων. @el

παναθηναϊκός αμφορέας
type: Form

lexical concept παναθηναϊκός αμφορέας el
type: LexicalConcept
is evoked by: παναθηναϊκός αμφορέας
definition: Αμφορέας που δίνεται ως έπαθλο σε νικητές των Παναθηναίων. @el

πελίκη
type: LexicalEntry
lexical form: πελίκη
evokes: lexical concept πελίκη el
denotes: pelike
type: Term
termName: πελίκη
language: el
denotedConcept: pelike
termStatus: preferred
partOfSpeech: preferred
gender: preferred
termDefinition: Αμφορέας με πόδι, ευδιάκριτο λαιμό και κοιλιά που γέρνει προς τα κάτω.
definition: Αμφορέας με πόδι, ευδιάκριτο λαιμό και κοιλιά που γέρνει προς τα κάτω. @el

πελίκη
type: Form

lexical concept πελίκη el
type: LexicalConcept
is evoked by: πελίκη
definition: Αμφορέας με πόδι, ευδιάκριτο λαιμό και κοιλιά που γέρνει προς τα κάτω. @el

κρατήρας κωδωνόσχημος
type: LexicalEntry
lexical form: κρατήρας κωδωνόσχημος
evokes: lexical concept κρατήρας κωδωνόσχημος el
denotes: bell krater
type: Term
termName: κρατήρας κωδωνόσχημος
language: el
denotedConcept: bell krater
termStatus: preferred
partOfSpeech: preferred
gender: preferred
termDefinition: Κρατήρας χωρίς λαιμό, με λαβές καμπυλωτές προς τα πάνω που βρίσκονται ψηλά στο σώμα του αγγείου.
definition: Κρατήρας χωρίς λαιμό, με λαβές καμπυλωτές προς τα πάνω που βρίσκονται ψηλά στο σώμα του αγγείου. @el

κρατήρας κωδωνόσχημος
type: Form

lexical concept κρατήρας κωδωνόσχημος el
type: LexicalConcept
is evoked by: κρατήρας κωδωνόσχημος
definition: Κρατήρας χωρίς λαιμό, με λαβές καμπυλωτές προς τα πάνω που βρίσκονται ψηλά στο σώμα του αγγείου. @el

ὑδρία
type: LexicalEntry
lexical form: ὑδρία
evokes: lexical concept ὑδρία el
denotes: hydria
type: Term
termName: ὑδρία
language: el
denotedConcept: hydria
termStatus: alternative
partOfSpeech: alternative
gender: alternative
termDefinition: Αγγείο για αποθήκευση και μεταφορά νερού με τρεις λαβές και λαιμό
definition: Αγγείο για αποθήκευση και μεταφορά νερού με τρεις λαβές και λαιμό @el
note: http:www.perseus.tufts.eduhoppermorph?l=u%28dri%2Fa&la=greek#lexicon @el

ὑδρία
type: Form

lexical concept ὑδρία el
type: LexicalConcept
is evoked by: ὑδρία
definition: Αγγείο για αποθήκευση και μεταφορά νερού με τρεις λαβές και λαιμό @el

κρατήρας ελικοειδής
type: LexicalEntry
lexical form: κρατήρας ελικοειδής
evokes: lexical concept κρατήρας ελικοειδής el
denotes: volute krater
type: Term
termName: κρατήρας ελικοειδής
language: el
denotedConcept: volute krater
termStatus: preferred
partOfSpeech: preferred
gender: preferred
termDefinition: Κρατήρας με λαιμό και ελικοειδείς λαβές.
definition: Κρατήρας με λαιμό και ελικοειδείς λαβές. @el

κρατήρας ελικοειδής
type: Form

lexical concept κρατήρας ελικοειδής el
type: LexicalConcept
is evoked by: κρατήρας ελικοειδής
definition: Κρατήρας με λαιμό και ελικοειδείς λαβές. @el

αμφορέας
type: LexicalEntry
lexical form: αμφορέας
evokes: lexical concept αμφορέας el
denotes: amphora
type: Term
termName: αμφορέας
language: el
denotedConcept: amphora
termStatus: preferred
partOfSpeech: preferred
gender: preferred
termDefinition: Αγγείο για αποθήκευση και μεταφορά, με λαιμό, με δύο λαβές, για υγρά ή στερεά.
definition: Αγγείο για αποθήκευση και μεταφορά, με λαιμό, με δύο λαβές, για υγρά ή στερεά. @el
note: modern greek @el

αμφορέας
type: Form

lexical concept αμφορέας el
type: LexicalConcept
is evoked by: αμφορέας
definition: Αγγείο για αποθήκευση και μεταφορά, με λαιμό, με δύο λαβές, για υγρά ή στερεά. @el

αμφορέας τύπου Β
type: LexicalEntry
lexical form: αμφορέας τύπου Β
evokes: lexical concept αμφορέας τύπου Β el
denotes: type B amphora
type: Term
termName: αμφορέας τύπου Β
language: el
denotedConcept: type B amphora
termStatus: preferred
partOfSpeech: preferred
gender: preferred
termDefinition: Αμφορέας με στρογγυλές λαβές και κοιλιά με ίσιο στόμιο, .
definition: Αμφορέας με στρογγυλές λαβές και κοιλιά με ίσιο στόμιο, . @el

αμφορέας τύπου Β
type: Form

lexical concept αμφορέας τύπου Β el
type: LexicalConcept
is evoked by: αμφορέας τύπου Β
definition: Αμφορέας με στρογγυλές λαβές και κοιλιά με ίσιο στόμιο, . @el

κρατήρας καλυκοειδής
type: LexicalEntry
lexical form: κρατήρας καλυκοειδής
evokes: lexical concept κρατήρας καλυκοειδής el
denotes: calyx krater
type: Term
termName: κρατήρας καλυκοειδής
language: el
denotedConcept: calyx krater
termStatus: preferred
partOfSpeech: preferred
gender: preferred
termDefinition: Κρατήρας χωρίς λαιμό, με λαβές καμπυλωτές προς τα πάνω που βρίσκονται χαμηλά στο σώμα του αγγείου.
definition: Κρατήρας χωρίς λαιμό, με λαβές καμπυλωτές προς τα πάνω που βρίσκονται χαμηλά στο σώμα του αγγείου. @el

κρατήρας καλυκοειδής
type: Form

lexical concept κρατήρας καλυκοειδής el
type: LexicalConcept
is evoked by: κρατήρας καλυκοειδής
definition: Κρατήρας χωρίς λαιμό, με λαβές καμπυλωτές προς τα πάνω που βρίσκονται χαμηλά στο σώμα του αγγείου. @el

υδρία
type: LexicalEntry
lexical form: υδρία
evokes: lexical concept υδρία el
denotes: hydria
type: Term
termName: υδρία
language: el
denotedConcept: hydria
termStatus: preferred
partOfSpeech: preferred
gender: preferred
termDefinition: Αγγείο για αποθήκευση και μεταφορά νερού, με τρεις λαβές και λαιμό.
definition: Αγγείο για αποθήκευση και μεταφορά νερού, με τρεις λαβές και λαιμό. @el
note: modern greek @el

υδρία
type: Form

lexical concept υδρία el
type: LexicalConcept
is evoked by: υδρία
definition: Αγγείο για αποθήκευση και μεταφορά νερού, με τρεις λαβές και λαιμό. @el

αμφορέας με κοιλιά
type: LexicalEntry
lexical form: αμφορέας με κοιλιά
evokes: lexical concept αμφορέας με κοιλιά el
denotes: belly amphora
type: Term
termName: αμφορέας με κοιλιά
language: el
denotedConcept: belly amphora
termStatus: preferred
partOfSpeech: preferred
gender: preferred
termDefinition: Αμφορέας με πόδι, ευδιάκριτο λαιμό και κανονική κοιλιά.
definition: Αμφορέας με πόδι, ευδιάκριτο λαιμό και κανονική κοιλιά. @el

αμφορέας με κοιλιά
type: Form

lexical concept αμφορέας με κοιλιά el
type: LexicalConcept
is evoked by: αμφορέας με κοιλιά
definition: Αμφορέας με πόδι, ευδιάκριτο λαιμό και κανονική κοιλιά. @el

ἀμφορεύς
type: LexicalEntry
lexical form: ἀμφορεύς
evokes: lexical concept ἀμφορεύς el
denotes: amphora
type: Term
termName: ἀμφορεύς
language: el
denotedConcept: amphora
termStatus: alternative
partOfSpeech: alternative
gender: alternative
termDefinition: Αγγείο για αποθήκευση και μεταφορά, με λαιμό, με δύο λαβές, για υγρά ή στερεά.
definition: Αγγείο για αποθήκευση και μεταφορά, με λαιμό, με δύο λαβές, για υγρά ή στερεά. @el
note: The term first appears in Linear B tablets dating in the 2nd millenium B.C. @el

ἀμφορεύς
type: Form

lexical concept ἀμφορεύς el
type: LexicalConcept
is evoked by: ἀμφορεύς
definition: Αγγείο για αποθήκευση και μεταφορά, με λαιμό, με δύο λαβές, για υγρά ή στερεά. @el

αμφορέας με λαιμό
type: LexicalEntry
lexical form: αμφορέας με λαιμό
evokes: lexical concept αμφορέας με λαιμό el
denotes: neck amphora
type: Term
termName: αμφορέας με λαιμό
language: el
denotedConcept: neck amphora
termStatus: preferred
partOfSpeech: preferred
gender: preferred
termDefinition: Αμφορέας με πόδι, ευδιάκριτο λαιμό και κανονική κοιλιά.
definition: Αμφορέας με πόδι, ευδιάκριτο λαιμό και κανονική κοιλιά. @el

αμφορέας με λαιμό
type: Form

lexical concept αμφορέας με λαιμό el
type: LexicalConcept
is evoked by: αμφορέας με λαιμό
definition: Αμφορέας με πόδι, ευδιάκριτο λαιμό και κανονική κοιλιά. @el

λήκυθος
type: LexicalEntry
lexical form: λήκυθος
evokes: lexical concept λήκυθος el
denotes: lekythos
type: Term
termName: λήκυθος
language: el
denotedConcept: lekythos
termStatus: preferred
partOfSpeech: preferred
gender: preferred
termDefinition: Αγγείο για άρωμα, με στενό λαιμό, με μία λαβή.
definition: Αγγείο για άρωμα, με στενό λαιμό, με μία λαβή. @el

λήκυθος
type: Form

lexical concept λήκυθος el
type: LexicalConcept
is evoked by: λήκυθος
definition: Αγγείο για άρωμα, με στενό λαιμό, με μία λαβή. @el

κρατήρ
type: LexicalEntry
lexical form: κρατήρ
evokes: lexical concept κρατήρ el
denotes: krater
type: Term
termName: κρατήρ
language: el
denotedConcept: krater
termStatus: alternative
partOfSpeech: alternative
gender: alternative
termDefinition: Αγγείο για τη μείξη οίνου και ύδατος, με λαβές, πόδι και ανοικτό στόμιο.
definition: Αγγείο για τη μείξη οίνου και ύδατος, με λαβές, πόδι και ανοικτό στόμιο. @el

κρατήρ
type: Form

lexical concept κρατήρ el
type: LexicalConcept
is evoked by: κρατήρ
definition: Αγγείο για τη μείξη οίνου και ύδατος, με λαβές, πόδι και ανοικτό στόμιο. @el

αμφορέας τύπου Γ
type: LexicalEntry
lexical form: αμφορέας τύπου Γ
evokes: lexical concept αμφορέας τύπου Γ el
denotes: type C amphora
type: Term
termName: αμφορέας τύπου Γ
language: el
denotedConcept: type C amphora
termStatus: preferred
partOfSpeech: preferred
gender: preferred
termDefinition: Αμφορέας με στρογγυλές λαβές και κοιλιά με στρογγυλό χείλος, .
definition: Αμφορέας με στρογγυλές λαβές και κοιλιά με στρογγυλό χείλος, . @el

αμφορέας τύπου Γ
type: Form

lexical concept αμφορέας τύπου Γ el
type: LexicalConcept
is evoked by: αμφορέας τύπου Γ
definition: Αμφορέας με στρογγυλές λαβές και κοιλιά με στρογγυλό χείλος, . @el

αγγείο
type: LexicalEntry
lexical form: αγγείο
evokes: lexical concept αγγείο el
denotes: vase
type: Term
termName: αγγείο
language: el
denotedConcept: vase
termStatus: preferred
partOfSpeech: preferred
gender: preferred

αγγείο
type: Form

κρατήρας
type: LexicalEntry
lexical form: κρατήρας
evokes: lexical concept κρατήρας el
denotes: krater
type: Term
termName: κρατήρας
language: el
denotedConcept: krater
termStatus: preferred
partOfSpeech: preferred
gender: preferred
termDefinition: Αγγείο με λαβές, πόδι, ανοικτό στόμιο για τη μείξη οίνου και ύδατος
definition: Αγγείο με λαβές, πόδι, ανοικτό στόμιο για τη μείξη οίνου και ύδατος @el
note: --- new note --- @el

κρατήρας
type: Form

lexical concept κρατήρας el
type: LexicalConcept
is evoked by: κρατήρας
definition: Αγγείο με λαβές, πόδι, ανοικτό στόμιο για τη μείξη οίνου και ύδατος @el

OTVCore
type: Class
comment: The Generic Concept of OTV Concepts

Concept
type: Class
subclass of: OTVCore
comment: The class of OTV Concept
comment: Les concepts sont des instances de la classe Concept
disjoint with: AxisOfAnalysis
disjoint with: Difference
disjoint with: Relation
disjoint with: Attribute
disjoint with: Object
disjoint with: Term
disjoint with: ProperName

AxisOfAnalysis
type: Class
subclass of: OTVCore
comment: The class of OTV AxesOfAnalysis
comment: Les axes d analyse sont des instances de la classe AxesOfAnalysis
disjoint with: Concept
disjoint with: Difference
disjoint with: Relation
disjoint with: Attribute
disjoint with: Object
disjoint with: Term
disjoint with: ProperName

Difference
type: Class
subclass of: OTVCore
comment: The class of OTV Differences
comment: Les différence sont des instances de la classe Difference
disjoint with: AxisOfAnalysis
disjoint with: Concept
disjoint with: Relation
disjoint with: Attribute
disjoint with: Object
disjoint with: Term
disjoint with: ProperName

Relation
type: Class
subclass of: OTVCore
comment: The class of OTV Relations
disjoint with: AxisOfAnalysis
disjoint with: Difference
disjoint with: Concept
disjoint with: Attribute
disjoint with: Object
disjoint with: Term
disjoint with: ProperName

Attribute
type: Class
subclass of: OTVCore
comment: The class of OTV Attributes
disjoint with: AxisOfAnalysis
disjoint with: Difference
disjoint with: Relation
disjoint with: Concept
disjoint with: Object
disjoint with: Term
disjoint with: ProperName

Object
type: Class
subclass of: OTVCore
comment: The class of OTV Objects
disjoint with: AxisOfAnalysis
disjoint with: Difference
disjoint with: Relation
disjoint with: Attribute
disjoint with: Concept
disjoint with: Term
disjoint with: ProperName

Term
type: Class
subclass of: OTVCore
comment: The class of OTV Terms
disjoint with: AxisOfAnalysis
disjoint with: Difference
disjoint with: Relation
disjoint with: Attribute
disjoint with: Object
disjoint with: Concept
disjoint with: ProperName

ProperName
type: Class
subclass of: OTVCore
comment: The class of OTV ProperName
disjoint with: AxisOfAnalysis
disjoint with: Difference
disjoint with: Relation
disjoint with: Attribute
disjoint with: Object
disjoint with: Term
disjoint with: Concept

isA
type: ObjectProperty
comment: Generic relationship between 2 concepts
domain: Concept
range: Concept

ownDifference
type: ObjectProperty
comment: Link a concept to one of its specific differences
domain: Concept
range: Difference

inheritedDifference
type: ObjectProperty
comment: Link a concept to one of its inherited differences
domain: Concept
range: Difference

difference
type: ObjectProperty
comment: Link a concept to one of its differences either inherited or specific
domain: Concept
range: Difference

belongsToAxis
type: ObjectProperty
comment: Indicate the axis of analysis to which the difference belongs
domain: Difference
range: AxisOfAnalysis

containsDifference
type: ObjectProperty
comment: Indicate the differences which belongs to the axis of analysis
domain: AxisOfAnalysis
range: Difference

attribute
type: ObjectProperty
comment: Link a concept to one of its attributes either inherited or specific
domain: Concept
range: Attribute

instanceOf
type: ObjectProperty
comment: instance relationship
domain: Object
range: Concept

denotedByTerm
type: ObjectProperty
comment: Link a concept to a term which denotes it
domain: Concept
range: Term

denotedConcept
type: ObjectProperty
comment: Property whose value is the OTV concept denoted by the term: 'a term is a verbal designation of a concept' (ISO 1087)
domain: Term
range: Concept

denotedByProperName
type: ObjectProperty
comment: The denotedByPrperName property links an individual (object) to a proper name which denotes it
domain: Object
range: ProperName

denotedObject
type: ObjectProperty
comment: Property whose value is the OTV object denoted by the proper name
domain: ProperName
range: Object

conceptName
type: AnnotationProperty
comment: Name of the concept
domain: Concept
range: string

termName
type: AnnotationProperty
comment: String representing the term
domain: Term
range: string

properName
type: AnnotationProperty
comment: String representing the proper name
domain: ProperName
range: string

language
type: AnnotationProperty
comment: Property that denotes the language of the term
domain: Class
  union of: Term
  union of: ProperName
range: string

termStatus
type: AnnotationProperty
comment: Property that indicates the status of the term
domain: Term
range: string

termDefinition
type: AnnotationProperty
comment: Defintion of the term in natural language
domain: Term
range: string

context
type: AnnotationProperty
comment: Context associated to the term
domain: Term

note
type: AnnotationProperty
comment: Note associated to the term
domain: Term

partOfSpeech
type: AnnotationProperty
comment: Part of Speech of the term
domain: Term
range: string

gender
type: AnnotationProperty
comment: Gender of the term
domain: Term
range: string

beginDate
type: AnnotationProperty
comment: Property that indicates the begin date of of an axis of analysis, concept, term, object
domain: OTVCore
range: dateTime

endDate
type: AnnotationProperty
comment: Property that indicates the end date of of an axis of analysis, concept, term, object
domain: OTVCore
range: dateTime

2 Function
type: AxisOfAnalysis
containsDifference: for drinking
containsDifference: for mixing wine with water
containsDifference: for perfume
containsDifference: for pouring
containsDifference: for prize
containsDifference: for ritual
containsDifference: for storing and transport

for drinking
type: Difference
belongsToAxis: 2 Function

for mixing wine with water
type: Difference
belongsToAxis: 2 Function

for perfume
type: Difference
belongsToAxis: 2 Function

for pouring
type: Difference
belongsToAxis: 2 Function

for prize
type: Difference
belongsToAxis: 2 Function

for ritual
type: Difference
belongsToAxis: 2 Function

for storing and transport
type: Difference
belongsToAxis: 2 Function

3 Contents
type: AxisOfAnalysis
containsDifference: liquid only
containsDifference: liquid or solid
containsDifference: solid only

liquid only
type: Difference
belongsToAxis: 3 Contents

liquid or solid
type: Difference
belongsToAxis: 3 Contents

solid only
type: Difference
belongsToAxis: 3 Contents

3.1 Type of liquid
type: AxisOfAnalysis
containsDifference: oil
containsDifference: water

oil
type: Difference
belongsToAxis: 3.1 Type of liquid

water
type: Difference
belongsToAxis: 3.1 Type of liquid

4 Type of mouth
type: AxisOfAnalysis
containsDifference: with closed mouth
containsDifference: with open mouth

with closed mouth
type: Difference
belongsToAxis: 4 Type of mouth

with open mouth
type: Difference
belongsToAxis: 4 Type of mouth

6.2 Type of neck width
type: AxisOfAnalysis
containsDifference: with narrow neck
containsDifference: with wide neck

with narrow neck
type: Difference
belongsToAxis: 6.2 Type of neck width

with wide neck
type: Difference
belongsToAxis: 6.2 Type of neck width

7 Type of body
type: AxisOfAnalysis
containsDifference: with cylindrical body
containsDifference: with globular body
containsDifference: with ovoid body
containsDifference: with tapering body

with cylindrical body
type: Difference
belongsToAxis: 7 Type of body

with globular body
type: Difference
belongsToAxis: 7 Type of body

with ovoid body
type: Difference
belongsToAxis: 7 Type of body

with tapering body
type: Difference
belongsToAxis: 7 Type of body

8 Handles
type: AxisOfAnalysis
containsDifference: with handles
containsDifference: without handle

with handles
type: Difference
belongsToAxis: 8 Handles

without handle
type: Difference
belongsToAxis: 8 Handles

Foot
type: AxisOfAnalysis
containsDifference: with foot
containsDifference: without foot

with foot
type: Difference
belongsToAxis: Foot

without foot
type: Difference
belongsToAxis: Foot

1 Category
type: AxisOfAnalysis
containsDifference: material
containsDifference: part
containsDifference: person
containsDifference: place
containsDifference: vessel

material
type: Difference
belongsToAxis: 1 Category

part
type: Difference
belongsToAxis: 1 Category

person
type: Difference
belongsToAxis: 1 Category

place
type: Difference
belongsToAxis: 1 Category

vessel
type: Difference
belongsToAxis: 1 Category

5 Type of lip
type: AxisOfAnalysis
containsDifference: with round lip
containsDifference: with straight lip

with round lip
type: Difference
belongsToAxis: 5 Type of lip

with straight lip
type: Difference
belongsToAxis: 5 Type of lip

Type of foot
type: AxisOfAnalysis

Type of belly
type: AxisOfAnalysis
containsDifference: with sagging belly
containsDifference: with standard belly

with sagging belly
type: Difference
belongsToAxis: Type of belly

with standard belly
type: Difference
belongsToAxis: Type of belly

8.1 Number of handles
type: AxisOfAnalysis
containsDifference: with more than three handles
containsDifference: with one handle
containsDifference: with three handles
containsDifference: with two handles

with more than three handles
type: Difference
belongsToAxis: 8.1 Number of handles

with one handle
type: Difference
belongsToAxis: 8.1 Number of handles

with three handles
type: Difference
belongsToAxis: 8.1 Number of handles

with two handles
type: Difference
belongsToAxis: 8.1 Number of handles

8.3 Place of the upward curling handles on the body
type: AxisOfAnalysis
containsDifference: upward curling handles placed high on the body
containsDifference: upward curling handles placed low on the body

upward curling handles placed high on the body
type: Difference
belongsToAxis: 8.3 Place of the upward curling handles on the body

upward curling handles placed low on the body
type: Difference
belongsToAxis: 8.3 Place of the upward curling handles on the body

6 Neck
type: AxisOfAnalysis
containsDifference: with neck
containsDifference: without neck

with neck
type: Difference
belongsToAxis: 6 Neck

without neck
type: Difference
belongsToAxis: 6 Neck

9 Shoulder
type: AxisOfAnalysis
containsDifference: with shoulders
containsDifference: without shoulders

with shoulders
type: Difference
belongsToAxis: 9 Shoulder

without shoulders
type: Difference
belongsToAxis: 9 Shoulder

6.1 Neck Clearly Defined
type: AxisOfAnalysis
containsDifference: with a clearly defined neck
containsDifference: without a clearly defined neck

with a clearly defined neck
type: Difference
belongsToAxis: 6.1 Neck Clearly Defined

without a clearly defined neck
type: Difference
belongsToAxis: 6.1 Neck Clearly Defined

8.2 Type of handles
type: AxisOfAnalysis
containsDifference: with column-like handles
containsDifference: with flat handles
containsDifference: with round handles
containsDifference: with upward curling handles
containsDifference: with volute-like handles

with column-like handles
type: Difference
belongsToAxis: 8.2 Type of handles

with flat handles
type: Difference
belongsToAxis: 8.2 Type of handles

with round handles
type: Difference
belongsToAxis: 8.2 Type of handles

with upward curling handles
type: Difference
belongsToAxis: 8.2 Type of handles

with volute-like handles
type: Difference
belongsToAxis: 8.2 Type of handles

Beazley-30217 en
type: ProperName
properName: Beazley-30217
language: en
denotedObject: Beazley-30217

Beazley-218059 en
type: ProperName
properName: Beazley-218059
language: en
denotedObject: Beazley-218059

Agora of Athens en
type: ProperName
properName: Agora of Athens
language: en
denotedObject: place-37.975,23.7225

Beazley-217511 en
type: ProperName
properName: Beazley-217511
language: en
denotedObject: Beazley-217511

Beazley-215424 en
type: ProperName
properName: Beazley-215424
language: en
denotedObject: Beazley-215424

Beazley-5556 en
type: ProperName
properName: Beazley-5556
language: en
denotedObject: Beazley-5556

Beazley-215332 en
type: ProperName
properName: Beazley-215332
language: en
denotedObject: Beazley-215332

Beazley-31357 en
type: ProperName
properName: Beazley-31357
language: en
denotedObject: Beazley-31357

Beazley-217564 en
type: ProperName
properName: Beazley-217564
language: en
denotedObject: Beazley-217564

Beazley-218103 en
type: ProperName
properName: Beazley-218103
language: en
denotedObject: Beazley-218103

Beazley-19653 en
type: ProperName
properName: Beazley-19653
language: en
denotedObject: Beazley-19653

Beazley-218065 en
type: ProperName
properName: Beazley-218065
language: en
denotedObject: Beazley-218065

François vase en
type: ProperName
properName: François vase
language: en
denotedObject: François vase

Beazley-218046 en
type: ProperName
properName: Beazley-218046
language: en
denotedObject: Beazley-218046

Beazley-214877 en
type: ProperName
properName: Beazley-214877
language: en
denotedObject: Beazley-214877

Beazley-13332 en
type: ProperName
properName: Beazley-13332
language: en

Beazley-218043 en
type: ProperName
properName: Beazley-218043
language: en
denotedObject: Beazley-218043

Beazley-218130 en
type: ProperName
properName: Beazley-218130
language: en
denotedObject: Beazley-218130

Heraion Perachora en
type: ProperName
properName: Heraion Perachora
language: en
denotedObject: place-38.0281126064,22.8528202479

Beazley-218085 en
type: ProperName
properName: Beazley-218085
language: en
denotedObject: Beazley-218085

Beazley-46072 en
type: ProperName
properName: Beazley-46072
language: en
denotedObject: Beazley-46072

Beazley-217927 en
type: ProperName
properName: Beazley-217927
language: en
denotedObject: Beazley-217927

Beazley-218073 en
type: ProperName
properName: Beazley-218073
language: en
denotedObject: Beazley-218073

Beazley-10936 en
type: ProperName
properName: Beazley-10936
language: en
denotedObject: Beazley-10936

Beazley-214878 en
type: ProperName
properName: Beazley-214878
language: en
denotedObject: Beazley-214878

Beazley-16377 en
type: ProperName
properName: Beazley-16377
language: en
denotedObject: Beazley-16377

Beazley-218101 en
type: ProperName
properName: Beazley-218101
language: en
denotedObject: Beazley-218101

Beazley-218153 en
type: ProperName
properName: Beazley-218153
language: en
denotedObject: Beazley-218153

Crete en
type: ProperName
properName: Crete
language: en
denotedObject: place-35.2198443917,24.9957699715

Beazley-218131 en
type: ProperName
properName: Beazley-218131
language: en
denotedObject: Beazley-218131

Beazley-30209 en
type: ProperName
properName: Beazley-30209
language: en
denotedObject: Beazley-30209

Beazley-31359 en
type: ProperName
properName: Beazley-31359
language: en
denotedObject: Beazley-31359

Boeotia en
type: ProperName
properName: Boeotia
language: en
denotedObject: place-38.3466880333,23.1846775333

Perachora en
type: ProperName
properName: Perachora
language: en
denotedObject: place-38.0281126064,22.8528202479

Beazley-31356 en
type: ProperName
properName: Beazley-31356
language: en
denotedObject: Beazley-31356

Beazley-218337 en
type: ProperName
properName: Beazley-218337
language: en
denotedObject: Beazley-218337

Beazley-30210 en
type: ProperName
properName: Beazley-30210
language: en
denotedObject: Beazley-30210

Beazley-12595 fr
type: ProperName
properName: Beazley-12595
language: fr

Agora d'Athènes fr
type: ProperName
properName: Agora d'Athènes
language: fr
denotedObject: place-37.975,23.7225

Beazley-10936 fr
type: ProperName
properName: Beazley-10936
language: fr
denotedObject: Beazley-10936

Βοιωτία el
type: ProperName
properName: Βοιωτία
language: el
denotedObject: place-38.3466880333,23.1846775333

Αρχαία Αγορά, Αθήνα el
type: ProperName
properName: Αρχαία Αγορά, Αθήνα
language: el
denotedObject: place-37.975,23.7225

Beazley-10936 el
type: ProperName
properName: Beazley-10936
language: el
denotedObject: Beazley-10936